CH3CHNH2
- Formula: C2H6N
- Molecular weight: 44.0757
- IUPAC Standard InChIKey: LLAPDLPYIYKTGQ-UHFFFAOYSA-N
- CAS Registry Number: 30208-36-7
- Chemical structure:
View 3d structure (requires JavaScript / HTML 5) - Permanent link for this species. Use this link for bookmarking this species for future reference.

Gas phase ion energetics data

Data compiled as indicated in comments:
LBLHLM - Sharon G. Lias, John E. Bartmess, Joel F. Liebman, John L. Holmes, Rhoda D. Levin, and W. Gary Mallard
Quantity | Value | Units | Method | Reference | Comment |
---|---|---|---|---|---|
ΔfH°(+) ion | 657. | kJ/mol | N/A | N/A |
Ionization energy determinations
IE (eV) | Method | Reference | Comment |
---|---|---|---|
5.7 | DER | Burkey, Castelhano, et al., 1983 | LBLHLM |

References

Burkey, Castelhano, et al., 1983
Burkey, T.J.; Castelhano, A.L.; Griller, D.; Lossing, F.P.,
Heats of formation and ionization potentials of some α-aminoalkyl radicals,
J. Am. Chem. Soc., 1983, 105, 4701. [all data]