1-iodoacetone
- Formula: C3H5IO
- Molecular weight: 183.9757
- IUPAC Standard InChIKey: WEFSXBPMNKAUDL-UHFFFAOYSA-N
- CAS Registry Number: 3019-04-3
- Chemical structure:
View 3d structure (requires JavaScript / HTML 5) - Other names: 1-Iodo-2-propanone

Gas phase thermochemistry data

Data compiled by: Hussein Y. Afeefy, Joel F. Liebman, and Stephen E. Stein
Quantity | Value | Units | Method | Reference | Comment |
---|---|---|---|---|---|
ΔfH°gas | -130.6 ± 5.1 | kJ/mol | Eqk | Solly, Golden, et al., 1970 | Reanalyzed by Pedley, Naylor, et al., 1986, Original value = -130. ± 6.3 kJ/mol |

Reaction thermochemistry data

Data compiled by: Hussein Y. Afeefy, Joel F. Liebman, and Stephen E. Stein
Individual Reactions
By formula: C3H6O + I2 = HI + C3H5IO
Quantity | Value | Units | Method | Reference | Comment |
---|---|---|---|---|---|
ΔrH° | 50.6 ± 5.0 | kJ/mol | Eqk | Solly, Golden, et al., 1970 | gas phase |

Gas phase ion energetics data

Data compiled as indicated in comments:
LBLHLM - Sharon G. Lias, John E. Bartmess, Joel F. Liebman, John L. Holmes, Rhoda D. Levin, and W. Gary Mallard
Ionization energy determinations
IE (eV) | Method | Reference | Comment |
---|---|---|---|
9.3 | PE | Olivato, Guerrero, et al., 1984 | LBLHLM |
9.53 | PE | Olivato, Guerrero, et al., 1984 | Vertical value; LBLHLM |

References

Solly, Golden, et al., 1970
Solly, R.K.; Golden, D.M.; Benson, S.W.,
Thermochemical properties of iodoacetone. Intramolecular electrostatic interactions in polar molecules,
J. Am. Chem. Soc., 1970, 92, 4653-4656. [all data]
Pedley, Naylor, et al., 1986
Pedley, J.B.; Naylor, R.D.; Kirby, S.P.,
Thermochemical Data of Organic Compounds, Chapman and Hall, New York, 1986, 1-792. [all data]
Olivato, Guerrero, et al., 1984
Olivato, P.R.; Guerrero, S.A.; Modelli, A.; Granozzi, G.; Jones, D.; Distefano, G.,
Electronic interaction in heterosubstituted acetones studied by means of ultraviolet photoelectron and electron transmission spectroscopy,
J. Chem. Soc. Perkin Trans. 2, 1984, 1505. [all data]