Aluminum, dibromomethyl-
- Formula: CH3AlBr2
- Molecular weight: 201.824
- IUPAC Standard InChIKey: XBKBZMOLSULOEA-UHFFFAOYSA-L
- CAS Registry Number: 3017-75-2
- Chemical structure:
View 3d structure (requires JavaScript / HTML 5) - Permanent link for this species. Use this link for bookmarking this species for future reference.

Gas phase ion energetics data

Data compiled by: Sharon G. Lias, Rhoda D. Levin, and Sherif A. Kafafi
Ionization energy determinations
IE (eV) | Method | Reference | Comment |
---|---|---|---|
10.65 | PE | Barker, Lappert, et al., 1975 | Vertical value |

References

Barker, Lappert, et al., 1975
Barker, G.K.; Lappert, M.F.; Pedley, J.B.; Sharp, G.J.; Westwood, N.P.C.,
Bonding studies of boron and the group 3-5 elements. Part XV. He(I) photoelectron spectra of monomeric group 3 tri-halide, trimethyl, and mixed halogenomethyl species,
J. Chem. Soc. Dalton Trans., 1975, 1765. [all data]