Benzenebutanol, α-phenyl-
- Formula: C16H18O
- Molecular weight: 226.3135
- IUPAC Standard InChIKey: CAGIBUJGQRHYEW-UHFFFAOYSA-N
- CAS Registry Number: 30078-89-8
- Chemical structure:
View 3d structure (requires JavaScript / HTML 5) - Permanent link for this species. Use this link for bookmarking this species for future reference.

Gas phase ion energetics data

Data compiled by: Sharon G. Lias, John E. Bartmess, Joel F. Liebman, John L. Holmes, Rhoda D. Levin, and W. Gary Mallard
Ionization energy determinations
IE (eV) | Method | Reference |
---|---|---|
8.5 ± 0.1 | EI | Groenwold, Chess, et al., 1984 |
Appearance energy determinations
Ion | AE (eV) | Other Products | Method | Reference | Comment |
---|---|---|---|---|---|
C16H16+ | 8.5 ± 0.1 | H2O | EI | Groenwold, Chess, et al., 1984 |

References

Groenwold, Chess, et al., 1984
Groenwold, G.S.; Chess, E.K.; Gross, M.L.,
Structure of the intermediate formed in the reaction of the styrene radical cation and neutral styrene,
J. Am. Chem. Soc., 1984, 106, 539. [all data]