Benzenamine, N-dodecyl-
- Formula: C18H31N
- Molecular weight: 261.4454
- IUPAC Standard InChIKey: LQKYCMRSWKQVBQ-UHFFFAOYSA-N
- CAS Registry Number: 3007-74-7
- Chemical structure:
View 3d structure (requires JavaScript / HTML 5) - Other names: N-Dodecylaniline

Gas phase ion energetics data

Data compiled by: Henry M. Rosenstock, Keith Draxl, Bruce W. Steiner, and John T. Herron
Ionization energy determinations
IE (eV) | Method | Reference |
---|---|---|
7.5 | CTS | Briegleb and Czekalla, 1959 |

References

Briegleb and Czekalla, 1959
Briegleb, G.; Czekalla, J.,
Die Bestimmung von lonisierungsenergien aus den Spektren von Elektronenubergangskomplexen,
Z.Elektrochem., 1959, 63, 6. [all data]