N-Nonylaniline
- Formula: C15H25N
- Molecular weight: 219.3657
- IUPAC Standard InChIKey: KBNHOFDIDSVFMZ-UHFFFAOYSA-N
- CAS Registry Number: 3007-72-5
- Chemical structure:
View 3d structure (requires JavaScript / HTML 5) - Permanent link for this species. Use this link for bookmarking this species for future reference.

Gas phase ion energetics data

Data compiled by: Henry M. Rosenstock, Keith Draxl, Bruce W. Steiner, and John T. Herron
Ionization energy determinations
IE (eV) | Method | Reference |
---|---|---|
7.5 | CTS | Briegleb and Czekalla, 1959 |

References

Briegleb and Czekalla, 1959
Briegleb, G.; Czekalla, J.,
Die Bestimmung von lonisierungsenergien aus den Spektren von Elektronenubergangskomplexen,
Z.Elektrochem., 1959, 63, 6. [all data]