Germane, bromotriphenyl-
- Formula: C18H15BrGe
- Molecular weight: 383.86
- IUPAC Standard InChIKey: RBXJUAXJPPYIMY-UHFFFAOYSA-N
- CAS Registry Number: 3005-32-1
- Chemical structure:
View 3d structure (requires JavaScript / HTML 5) - Other names: Triphenylgermanium bromide

Gas phase ion energetics data

Data compiled by: Sharon G. Lias, Rhoda D. Levin, and Sherif A. Kafafi
Ionization energy determinations
IE (eV) | Method | Reference | Comment |
---|---|---|---|
9.17 ± 0.05 | PE | Distefano, Pignataro, et al., 1976 | Vertical value |

References

Distefano, Pignataro, et al., 1976
Distefano, G.; Pignataro, S.; Szepes, L.; Borossay, J.,
Photoelectron spectroscopy study of the triphenyl derivatives of the group IV elements,
J. Organomet. Chem., 1976, 104, 173. [all data]