1,3,5,2,4,6-Triazatriphosphorine,2,4-bis(dimethylamino)-2,4,6,6-tetrafluoro-2,2,4,4,6,6-hexahydro-
- Formula: C4H12F4N5P3
- Molecular weight: 299.0865
- IUPAC Standard InChIKey: PUBFGAYECUVAGF-UHFFFAOYSA-N
- CAS Registry Number: 30004-14-9
- Chemical structure:
View 3d structure (requires JavaScript / HTML 5) - Permanent link for this species. Use this link for bookmarking this species for future reference.

Gas phase ion energetics data

Data compiled as indicated in comments:
LLK - Sharon G. Lias, Rhoda D. Levin, and Sherif A. Kafafi
Ionization energy determinations
IE (eV) | Method | Reference | Comment |
---|---|---|---|
8.90 | EI | Clare and Sowerby, 1981 | LLK |

References

Clare and Sowerby, 1981
Clare, P.; Sowerby, D.B.,
Electron impact ionisation energies of some halo-cyclotriphosphazenes,
J. Inorg. Nucl. Chem., 1981, 43, 477. [all data]