Cyclopentane, 1,2-dimethoxy-, trans-
- Formula: C7H14O2
- Molecular weight: 130.1849
- IUPAC Standard InChIKey: YLBQPTZQSYROOF-BQBZGAKWSA-N
- CAS Registry Number: 29887-56-7
- Chemical structure:
View 3d structure (requires JavaScript / HTML 5) - Stereoisomers:
- Other names: trans-1,2-Dimethoxycyclopentane

Gas phase ion energetics data

Data compiled as indicated in comments:
LLK - Sharon G. Lias, Rhoda D. Levin, and Sherif A. Kafafi
Ionization energy determinations
IE (eV) | Method | Reference | Comment |
---|---|---|---|
8.7 | PE | Brown, 1976 | LLK |
9.39 | PE | Brown, 1976 | Vertical value; LLK |

References

Brown, 1976
Brown, R.S.,
Application of photoelectron spectroscopy to intramolecularly hydrogen-bonded systems. Part III. The photoelectron spectra of cis and trans 2-substituted cyclopentanols cis and trans 2-substituted cyclohexanols,
Can. J. Chem., 1976, 54, 1929. [all data]