1,3,5,2,4,6-Triazatriphosphorine,2,4-dibromo-2,4,6,6-tetrafluoro-2,2,4,4,6,6-hexahydro-
- Formula: Br2F4N3P3
- Molecular weight: 370.743
- IUPAC Standard InChIKey: WUBUUOCNKQBQBR-UHFFFAOYSA-N
- CAS Registry Number: 29871-63-4
- Chemical structure:
View 3d structure (requires JavaScript / HTML 5) - Permanent link for this species. Use this link for bookmarking this species for future reference.

Gas phase ion energetics data

Data compiled as indicated in comments:
LLK - Sharon G. Lias, Rhoda D. Levin, and Sherif A. Kafafi
Ionization energy determinations
IE (eV) | Method | Reference | Comment |
---|---|---|---|
10.63 ± 0.03 | EI | Clare and Sowerby, 1981 | LLK |
Appearance energy determinations
Ion | AE (eV) | Other Products | Method | Reference | Comment |
---|---|---|---|---|---|
BrF4N3P3+ | 11.47 | Br | EI | Clare and Sowerby, 1981 | LLK |
Br2F3N3P3+ | 11.67 | F | EI | Clare and Sowerby, 1981 | LLK |

References

Clare and Sowerby, 1981
Clare, P.; Sowerby, D.B.,
Electron impact ionisation energies of some halo-cyclotriphosphazenes,
J. Inorg. Nucl. Chem., 1981, 43, 477. [all data]