1,3,5,2,4,6-Triazatriphosphorine,2,4-dichloro-2,4,6,6-tetrafluoro-2,2,4,4,6,6-hexahydro-
- Formula: Cl2F4N3P3
- Molecular weight: 281.841
- IUPAC Standard InChIKey: WXMJFOPZCHGDCK-UHFFFAOYSA-N
- CAS Registry Number: 29871-62-3
- Chemical structure:
View 3d structure (requires JavaScript / HTML 5) - Permanent link for this species. Use this link for bookmarking this species for future reference.

Gas phase ion energetics data

Data compiled as indicated in comments:
LLK - Sharon G. Lias, Rhoda D. Levin, and Sherif A. Kafafi
Ionization energy determinations
IE (eV) | Method | Reference | Comment |
---|---|---|---|
10.97 ± 0.03 | EI | Clare and Sowerby, 1981 | LLK |
Appearance energy determinations
Ion | AE (eV) | Other Products | Method | Reference | Comment |
---|---|---|---|---|---|
ClF4N3P3+ | 12.70 | Cl | EI | Clare and Sowerby, 1981 | LLK |
Cl2F3N3P3+ | 12.10 | F | EI | Clare and Sowerby, 1981 | LLK |

References

Clare and Sowerby, 1981
Clare, P.; Sowerby, D.B.,
Electron impact ionisation energies of some halo-cyclotriphosphazenes,
J. Inorg. Nucl. Chem., 1981, 43, 477. [all data]