Methyl parathion
- Formula: C8H10NO5PS
- Molecular weight: 263.207
- IUPAC Standard InChIKey: RLBIQVVOMOPOHC-UHFFFAOYSA-N
- CAS Registry Number: 298-00-0
- Chemical structure:
View 3d structure (requires JavaScript / HTML 5) - Other names: Phosphorothioic acid, O,O-dimethyl O-(4-nitrophenyl) ester; Phosphorothioic acid, O,O-dimethyl O-(p-nitrophenyl) ester; Azofos; Azophos; BAY 11405; Dimethyl p-Nitrophenyl phosphorothionate; Dimethyl p-nitrophenyl thiophosphate; Dimethyl parathion; Dimethyl 4-nitrophenyl phosphorothionate; DALF; Folidol M; Folidol M-40; M-Parathion; Meptox; Metacid 50; Metacide; Metaphos; Methyl-E 605; Methylthiophos; Metron; Metron (pesticide); Nitrox; Nitrox 80; O,O-Dimethyl O-(p-nitrophenyl) phosphorothioate; O,O-Dimethyl O-(p-nitrophenyl) thionophosphate; O,O-Dimethyl O-(p-nitrophenyl) thiophosphate; Parathion methyl; Parathion methyl homolog; Penncap M; Sinafid M-48; Thiophenit; Vofatox; Wofatox; Wofotox; 8056HC; O,O-Dimethyl O-4-nitrophenyl phosphorothioate; Bladan M; Cekumethion; Devithion; ENT 17292; Methyl-bladan; OMS 213; Parataf; Paratox; Partron M; Tekwaisa; Penncap MLS; Dimethyl 4-nitrophenyl phosphorothioate; Quinophos; Yphos; Paratuf; Folidol 600; Metafos; Oleovofotox; O,O-dimethyl-O-(4-nitrophenyl) thiophosphate

Phase change data

Data compiled as indicated in comments:
TRC - Thermodynamics Research Center, NIST Boulder Laboratories, Chris Muzny director
AC - William E. Acree, Jr., James S. Chickos
Quantity | Value | Units | Method | Reference | Comment |
---|---|---|---|---|---|
Tfus | 309.24 | K | N/A | Donnelly, Drewes, et al., 1990 | Uncertainty assigned by TRC = 0.2 K; TRC |
Tfus | 308.9 | K | N/A | Plato and Glasgow, 1969 | Uncertainty assigned by TRC = 0.1 K; TRC |
Enthalpy of vaporization
ΔvapH (kJ/mol) | Temperature (K) | Method | Reference | Comment |
---|---|---|---|---|
88.9 | 308. | A | Stephenson and Malanowski, 1987 | Based on data from 293. to 427. K.; AC |
Enthalpy of sublimation
ΔsubH (kJ/mol) | Temperature (K) | Method | Reference | Comment |
---|---|---|---|---|
125.1 | 303. | GS,A | Kim, Woodrow, et al., 1984 | Based on data from 298. to 308. K.; AC |
108.7 | 283. | GS | Spencer and Cliath, 1983 | Based on data from 278. to 288. K. See also Spencer, Shoup, et al., 1979.; AC |
Enthalpy of fusion
ΔfusH (kJ/mol) | Temperature (K) | Reference | Comment |
---|---|---|---|
20.07 | 308.2 | Acree, 1991 | AC |

Kovats' RI, non-polar column, isothermal

Column type | Active phase | Temperature (C) | I | Reference | Comment |
---|---|---|---|---|---|
Capillary | OV-1 | 190. | 1851. | Erdmann, Rochholz, et al., 1992 | |
Capillary | OV-1 | 220. | 1878. | Erdmann, Rochholz, et al., 1992 | |
Capillary | SPB-1 | 250. | 1905. | Lora-Tamayo, Rams, et al., 1986 | He; Column length: 25. m; Column diameter: 0.20 mm |

Kovats' RI, non-polar column, temperature ramp

Column type | Active phase | I | Reference | Comment |
---|---|---|---|---|
Capillary | DB-1 | 1856. | Hall, Whitehead, et al., 1986 | He, 6. K/min; Column length: 15. m; Column diameter: 0.25 mm; Tstart: 100. C; Tend: 270. C |
Capillary | DB-5 | 1903. | Hall, Whitehead, et al., 1986 | He, 6. K/min; Column length: 15. m; Column diameter: 0.25 mm; Tstart: 100. C; Tend: 270. C |

Kovats' RI, non-polar column, custom temperature program

Column type | Active phase | I | Reference | Comment |
---|---|---|---|---|
Packed | SE-30 | 1845. | Ramsey, Lee, et al., 1980 | He, Chromosorb G HP (80-100 mesh); Column length: 1.5 m; Program: not specified |

Normal alkane RI, non-polar column, isothermal

Column type | Active phase | Temperature (C) | I | Reference | Comment |
---|---|---|---|---|---|
Packed | OV-1 | 190. | 1855. | TSunoda, 1986 | Helium, Chromosorb W AW DMCS; Column length: 1. m |

Normal alkane RI, non-polar column, temperature ramp

Column type | Active phase | I | Reference | Comment |
---|---|---|---|---|
Packed | OV-1 | 1840. | TSunoda, 1986 | Helium, Chromosorb W AW DMCS, 4. K/min, 210. C @ 20. min; Column length: 1. m; Tstart: 140. C |
Packed | OV-1 | 1895. | Marozzi, Gambaro, et al., 1982 | Gas Chrom P, 2.5 K/min; Column length: 2. m; Tstart: 120. C; Tend: 200. C |
Packed | SE-30 | 1840. | Marozzi, Gambaro, et al., 1982 | Gas Chrom P, 2.5 K/min; Column length: 2. m; Tstart: 120. C; Tend: 200. C |

Normal alkane RI, non-polar column, custom temperature program

Column type | Active phase | I | Reference | Comment |
---|---|---|---|---|
Capillary | 5 % Phenyl methyl siloxane | 1896. | Department of Food Safety and Welfare, 2006 | 30. m/0.25 mm/0.25 μm, Helium; Program: 50 0C(1 min) 25 0C/min -> 125 0C 10 0C/min -> 300 0C (10 min) |
Capillary | 5 % Phenyl methyl siloxane | 1899. | Department of Food Safety and Welfare, 2006 | 30. m/0.25 mm/0.25 μm, Helium; Program: 50 0C(1 min) 25 0C/min -> 125 0C 10 0C/min -> 300 0C (10 min) |
Capillary | Methyl Silicone | 1843. | Zenkevich, Ostroukhova, et al., 2002 | Program: not specified |
Capillary | OV-1, SE-30, Methyl silicone, SP-2100, OV-101, DB-1, etc. | 1851. | Waggott and Davies, 1984 | Hydrogen; Column length: 50. m; Column diameter: 0.32 mm; Program: not specified |
Other | Methyl Silicone | 1851. | Ardrey and Moffat, 1981 | Program: not specified |

References

Donnelly, Drewes, et al., 1990
Donnelly, J.R.; Drewes, L.A.; Johnson, R.L.; Munslow, W.D.; Knapp, K.K.; Sovocool, G.W.,
Purity and heat of fusion data for environmental standards as determined by differential scanning calorimetry,
Thermochim. Acta, 1990, 167, 2, 155, https://doi.org/10.1016/0040-6031(90)80476-F
. [all data]
Plato and Glasgow, 1969
Plato, C.; Glasgow, A.R., Jr.,
Differential scanning calorimetry as a general method for determining the purity and heat of fusion of high-purity organic chemicals. Application to 95 compounds,
Anal. Chem., 1969, 41, 2, 330, https://doi.org/10.1021/ac60271a041
. [all data]
Stephenson and Malanowski, 1987
Stephenson, Richard M.; Malanowski, Stanislaw,
Handbook of the Thermodynamics of Organic Compounds, 1987, https://doi.org/10.1007/978-94-009-3173-2
. [all data]
Kim, Woodrow, et al., 1984
Kim, Yong-Hwa; Woodrow, James E.; Seiber, James N.,
Evaluation of a gas chromatographic method calculating vapor pressures with organophosphorus pesticides,
Journal of Chromatography A, 1984, 314, 37-53, https://doi.org/10.1016/S0021-9673(01)97721-0
. [all data]
Spencer and Cliath, 1983
Spencer, W.F.; Cliath, M.M.,
Measurement of pesticide vapor pressures, 1983, 57-71, https://doi.org/10.1007/978-1-4612-5462-16
. [all data]
Spencer, Shoup, et al., 1979
Spencer, William F.; Shoup, Thomas D.; Cliath, Mark M.; Farmer, Walter J.; Haque, Rizwanul,
Vapor pressures and relative volatility of ethyl and methyl parathion,
J. Agric. Food Chem., 1979, 27, 2, 273-278, https://doi.org/10.1021/jf60222a016
. [all data]
Acree, 1991
Acree, William E.,
Thermodynamic properties of organic compounds: enthalpy of fusion and melting point temperature compilation,
Thermochimica Acta, 1991, 189, 1, 37-56, https://doi.org/10.1016/0040-6031(91)87098-H
. [all data]