Allylamine, 1,1-dimethyl-
- Formula: C5H11N
- Molecular weight: 85.1475
- IUPAC Standard InChIKey: RBRPAKDHMRWACJ-UHFFFAOYSA-N
- CAS Registry Number: 2978-60-1
- Chemical structure:
View 3d structure (requires JavaScript / HTML 5) - Permanent link for this species. Use this link for bookmarking this species for future reference.

Gas phase ion energetics data

Data compiled by: Sharon G. Lias, John E. Bartmess, Joel F. Liebman, John L. Holmes, Rhoda D. Levin, and W. Gary Mallard
Appearance energy determinations
Ion | AE (eV) | Other Products | Method | Reference | Comment |
---|---|---|---|---|---|
C3H8N+ | 9.00 ± 0.05 | C2H3 | EI | Holmes and Lossing, 1984 |

References

Holmes and Lossing, 1984
Holmes, J.L.; Lossing, F.P.,
Heats of formation of organic radicals from appearance energies,
Int. J. Mass Spectrom. Ion Processes, 1984, 58, 113. [all data]