Pentacyclo[5.4.0.0(2,6).0(3,10).0(5,9)]undecane-8,11-dione
- Formula: C11H10O2
- Molecular weight: 174.1959
- IUPAC Standard InChIKey: WTUFOKOJVXNYTJ-UHFFFAOYSA-N
- CAS Registry Number: 2958-72-7
- Chemical structure:
View 3d structure (requires JavaScript / HTML 5) - Other names: Pentacyclo[5.4.0.02,6.03,10.05,9]undecan-8,11-dione; Pentacyclo[5.4.0.02,6.03,10.05,9]undecan-8,11-dione

Condensed phase thermochemistry data

Data compiled by: Hussein Y. Afeefy, Joel F. Liebman, and Stephen E. Stein
Quantity | Value | Units | Method | Reference | Comment |
---|---|---|---|---|---|
ΔfH°solid | -198.3 | kJ/mol | Ccb | Cookson, Crundwell, et al., 1964 | |
Quantity | Value | Units | Method | Reference | Comment |
ΔcH°solid | -5559.57 | kJ/mol | Ccb | Cookson, Crundwell, et al., 1964 | Corresponding ΔfHºsolid = -198.2 kJ/mol (simple calculation by NIST; no Washburn corrections) |

Phase change data

Data compiled as indicated in comments:
TRC - Thermodynamics Research Center, NIST Boulder Laboratories, Chris Muzny director
AC - William E. Acree, Jr., James S. Chickos
Quantity | Value | Units | Method | Reference | Comment |
---|---|---|---|---|---|
Ttriple | 516.8 | K | N/A | Weinstein, Leffler, et al., 1984 | Crystal phase 1 phase; Uncertainty assigned by TRC = 2. K; TRC |
Quantity | Value | Units | Method | Reference | Comment |
ΔsubH° | 92.6 ± 1.0 | kJ/mol | ME | Jiménez, Roux, et al., 1999 | AC |
Enthalpy of fusion
ΔfusH (kJ/mol) | Temperature (K) | Method | Reference | Comment |
---|---|---|---|---|
5.23 | 516.8 | DSC | Jiménez, Roux, et al., 1999 | AC |
3.94 | 516.8 | DSC | Weinstein, Leffler, et al., 1984, 2 | There is a large difference in the experimental enthalpies and transition temperature reported by the two research groups for the solid/solid transition around 355 K; AC |

Gas phase ion energetics data

Data compiled by: Sharon G. Lias, John E. Bartmess, Joel F. Liebman, John L. Holmes, Rhoda D. Levin, and W. Gary Mallard
Ionization energy determinations
IE (eV) | Method | Reference | Comment |
---|---|---|---|
9.1 | PE | Marchand, Kaya, et al., 1984 | Vertical value |

References

Cookson, Crundwell, et al., 1964
Cookson, R.C.; Crundwell, E.; Hill, R.R.; Hudec, J.,
586. Photochemical cyclisation of Diels-Alder adducts.,
J. Chem. Soc., 1964, 3062-3075. [all data]
Weinstein, Leffler, et al., 1984
Weinstein, D.I.; Leffler, A.J.; Currie, J.A.,
Phase Transitions in Bicyclic Compounds,
Mol. Cryst. Liq. Cryst., 1984, 104, 95. [all data]
Jiménez, Roux, et al., 1999
Jiménez, P.; Roux, M.V.; Dávalos, J.Z.; Abboud, J.-L.M.; Molina, M.T.,
Structural effects on the thermochemical properties of cycloalkanones. III. Enthalpy of combustion, vapour pressures, and enthalpy of sublimation, and standard enthalpy of formation in the gaseous phase of pentacyclo[5.4.0.02,6.03,10.05,9]undecane-8,11-dione,
The Journal of Chemical Thermodynamics, 1999, 31, 2, 263-271, https://doi.org/10.1006/jcht.1998.0450
. [all data]
Weinstein, Leffler, et al., 1984, 2
Weinstein, D.I.; Leffler, A.J.; Currie, J.A.,
Phase Transitions In Bicyclic Compounds,
Molecular Crystals and Liquid Crystals, 1984, 104, 1-2, 95-109, https://doi.org/10.1080/00268948408070401
. [all data]
Marchand, Kaya, et al., 1984
Marchand, A.P.; Kaya, R.; Baker, A.D.,
A photoelectron spectroscopic study of proximity effects in 8,11-disubstituted pentacyclo(5.4.0.02,6.03,10.05,9)undecanes,
Tetrahedron Lett., 1984, 25, 795. [all data]