Naphthalene, 1,1'-(1,4-butanediyl)bis-
- Formula: C24H22
- Molecular weight: 310.4315
- IUPAC Standard InChIKey: OISFPCIBPOZHNF-UHFFFAOYSA-N
- CAS Registry Number: 29571-17-3
- Chemical structure:
View 3d structure (requires JavaScript / HTML 5) - Permanent link for this species. Use this link for bookmarking this species for future reference.

Gas phase ion energetics data

Data compiled by: Sharon G. Lias, Rhoda D. Levin, and Sherif A. Kafafi
Ionization energy determinations
IE (eV) | Method | Reference |
---|---|---|
7.67 | PE | Berkowitz, Dehmer, et al., 1973 |

References

Berkowitz, Dehmer, et al., 1973
Berkowitz, J.; Dehmer, J.L.; Shimada, K.; Szwarc, M.,
Photoelectron spectroscopic studies of (α-naphthyl)-(CH2)4-(α-naphthyl) vapor: open chain or cyclic conformation?,
J. Electron Spectrosc. Relat. Phenom., 1973, 2, 211. [all data]