1,3-Dichloro-2,2-dimethylpropane
- Formula: C5H10Cl2
- Molecular weight: 141.039
- IUPAC Standard InChIKey: KTWNITKLQPCZSL-UHFFFAOYSA-N
- CAS Registry Number: 29559-55-5
- Chemical structure:
View 3d structure (requires JavaScript / HTML 5) - Permanent link for this species. Use this link for bookmarking this species for future reference.

Phase change data

Data compiled by: William E. Acree, Jr., James S. Chickos
Enthalpy of fusion
ΔfusH (kJ/mol) | Temperature (K) | Reference |
---|---|---|
1.6 | 262.2 | Gotze, Buhrmester, et al., 1999 |

References

Gotze, Buhrmester, et al., 1999
Gotze, A.; Buhrmester, C.; Svoboda, I.; Fuess, H.,
Crystal structures and phase transitions of 3-chloro-2,2-bis(chloromethyl)propionic acid-1 and 1,3-dichloro-2,2-dimethylpropane,
Croatica Chim. Acta, 1999, 72, 2-3, 443. [all data]