1,4,8,11-Tetraazacyclotetradecane
- Formula: C10H24N4
- Molecular weight: 200.3244
- IUPAC Standard InChIKey: MDAXKAUIABOHTD-UHFFFAOYSA-N
- CAS Registry Number: 295-37-4
- Chemical structure:
View 3d structure (requires JavaScript / HTML 5) - Other names: Cyclam

Condensed phase thermochemistry data

Data compiled as indicated in comments:
ALS - Hussein Y. Afeefy, Joel F. Liebman, and Stephen E. Stein
DH - Eugene S. Domalski and Elizabeth D. Hearing
Quantity | Value | Units | Method | Reference | Comment |
---|---|---|---|---|---|
ΔfH°solid | -116. ± 2. | kJ/mol | Ccb | Clay, Micheloni, et al., 1979 | ALS |
Quantity | Value | Units | Method | Reference | Comment |
ΔcH°solid | -7249. ± 2. | kJ/mol | Ccb | Clay, Micheloni, et al., 1979 | ALS |
Constant pressure heat capacity of solid
Cp,solid (J/mol*K) | Temperature (K) | Reference | Comment |
---|---|---|---|
374.61 | 298.15 | Clay and Steele, 1980 | Cp given as 1.87 J/g*K.; DH |

Phase change data

Data compiled by: William E. Acree, Jr., James S. Chickos
Enthalpy of sublimation
ΔsubH (kJ/mol) | Temperature (K) | Method | Reference | Comment |
---|---|---|---|---|
133.9 ± 2.5 | 362. | TE | Clay, Corr, et al., 1983 | Based on data from 352. to 372. K. |

Gas phase ion energetics data

Data compiled as indicated in comments:
LBLHLM - Sharon G. Lias, John E. Bartmess, Joel F. Liebman, John L. Holmes, Rhoda D. Levin, and W. Gary Mallard
Ionization energy determinations
IE (eV) | Method | Reference | Comment |
---|---|---|---|
7.8 | PE | Baker, Armen, et al., 1983 | LBLHLM |
8.5 | PE | Baker, Armen, et al., 1983 | Vertical value; LBLHLM |

References

Clay, Micheloni, et al., 1979
Clay, R.M.; Micheloni, M.; Paoletti, P.; Steele, W.V.,
Enthalpies of formation and solution of macrocyclic and noncyclic tetraaza ligands. Origins of the enthalpy term in the macrocyclic effect,
J. Am. Chem. Soc., 1979, 101, 4119-4122. [all data]
Clay and Steele, 1980
Clay, R.M.; Steele, W.V.,
Enthalpy of combustion of a copper complex. Standard enthalpy of formation of bis(nitrato)(1,4,8,11-tetraazacyclo-tetradecane)copper(II),
Inorg. Chem., 1980, 19(8), 2414-2416. [all data]
Clay, Corr, et al., 1983
Clay, R.M.; Corr, S.; Keenan, G.; Steele, W.V.,
Standard enthalpies of sublimation and vaporization of 1,4,8,11-tetraazacyclotetradecane and 1,4,8,11-tetraazaundecane. Gas-phase macrocyclic enthalpy,
J. Am. Chem. Soc., 1983, 105, 7, 2070-2071, https://doi.org/10.1021/ja00345a069
. [all data]
Baker, Armen, et al., 1983
Baker, A.D.; Armen, G.H.; Funaro, S.,
Oral levels of crown ethers and related macrocycles studies by ultraviolet photoelectron spectroscopy: Relationship to complexation studies,
J. Chem. Soc. Dalton Trans., 1983, 2519. [all data]