Phosphorodithioic acid, O,O,S-trimethyl ester
- Formula: C3H9O2PS2
- Molecular weight: 172.206
- IUPAC Standard InChIKey: ILDHFYGNYDICFB-UHFFFAOYSA-N
- CAS Registry Number: 2953-29-9
- Chemical structure:
View 3d structure (requires JavaScript / HTML 5) - Other names: O,O,S-Trimethyl dithiophosphate; O,O,S-Trimethyl phosphorodithioate

Gas phase ion energetics data

Data compiled by: Sharon G. Lias, Rhoda D. Levin, and Sherif A. Kafafi
Ionization energy determinations
IE (eV) | Method | Reference |
---|---|---|
9.0 ± 0.10 | EI | Santoro, 1973 |
Appearance energy determinations
Ion | AE (eV) | Other Products | Method | Reference | Comment |
---|---|---|---|---|---|
CH2PS+ | 14.05 ± 0.30 | H+HCHO+HS | EI | Santoro, 1973 | |
CH3+ | 14.50 ± 0.40 | ? | EI | Santoro, 1973 | |
CH4OP+ | 13.40 ± 0.30 | ? | EI | Santoro, 1973 | |
CH4O2P+ | 12.75 ± 0.20 | CH3S+HCHS | EI | Santoro, 1973 | |
C2H6OPS+ | 11.70 ± 0.20 | HCHO+HS | EI | Santoro, 1973 | |
C2H6OPS2+ | 10.20 ± 0.30 | CH3O | EI | Santoro, 1973 | |
C2H6O2P+ | 10.40 ± 0.10 | ? | EI | Santoro, 1973 | |
C2H6O2PS+ | 10.10 ± 0.10 | CH3S | EI | Santoro, 1973 | |
C2H6O2PS2+ | 9.65 ± 0.20 | CH3 | EI | Santoro, 1973 | |
C2H7OPS2+ | 10.00 ± 0.10 | HCHO | EI | Santoro, 1973 | |
C2H7O2PS+ | 10.35 ± 0.10 | HCHS | EI | Santoro, 1973 |

References

Santoro, 1973
Santoro, E.,
The fragmentation of some alkyl thiophosphate esters by electron-impact,
Org. Mass Spectrom., 1973, 7, 589. [all data]