Stannane, tetrakis(1-methylethyl)-
- Formula: C12H28Sn
- Molecular weight: 291.061
- IUPAC Standard InChIKey: NJASUIDIZMMYED-UHFFFAOYSA-N
- CAS Registry Number: 2949-42-0
- Chemical structure:
View 3d structure (requires JavaScript / HTML 5) - Other names: Tetraisopropyltin; Stannane, tetraisopropyl-; Tetraisopropylstannane; (iso-C3H7)4Sn; tetra-i-Propyltin

Gas phase thermochemistry data

Data compiled by: José A. Martinho Simões
Quantity | Value | Units | Method | Reference | Comment |
---|---|---|---|---|---|
ΔfH°gas | -119.6 ± 7.1 | kJ/mol | Review | Martinho Simões | Selected data |
ΔfH°gas | -140.1 ± 5.9 | kJ/mol | Review | Martinho Simões |

Condensed phase thermochemistry data

Data compiled by: José A. Martinho Simões
Quantity | Value | Units | Method | Reference | Comment |
---|---|---|---|---|---|
ΔfH°liquid | -184.5 ± 5.7 | kJ/mol | Review | Martinho Simões | Selected data |
ΔfH°liquid | -205.0 ± 4.2 | kJ/mol | Review | Martinho Simões | |
Quantity | Value | Units | Method | Reference | Comment |
ΔcH°liquid | -9116.9 ± 5.4 | kJ/mol | CC-SB | Coleman and Skinner, 1966 | Please also see Pedley and Rylance, 1977 and Cox and Pilcher, 1970. |
ΔcH°liquid | -9096.4 ± 3.8 | kJ/mol | CC-SB | Lautsch, Tröber, et al., 1963 | Please also see Cox and Pilcher, 1970. |

Phase change data

Data compiled as indicated in comments:
MS - José A. Martinho Simões
AC - William E. Acree, Jr., James S. Chickos
Quantity | Value | Units | Method | Reference | Comment |
---|---|---|---|---|---|
ΔvapH° | 64.9 ± 4.2 | kJ/mol | CC-SB | Coleman and Skinner, 1966 | MS |
Enthalpy of vaporization
ΔvapH (kJ/mol) | Temperature (K) | Method | Reference | Comment |
---|---|---|---|---|
48.0 ± 0.7 | 392. | N/A | Baev, 2001 | Based on data from 342. to 441. K.; AC |
56.4 | 333. to 393. | GC | Hawker, 1992 | AC |

Gas phase ion energetics data

Data compiled as indicated in comments:
LLK - Sharon G. Lias, Rhoda D. Levin, and Sherif A. Kafafi
Ionization energy determinations
IE (eV) | Method | Reference | Comment |
---|---|---|---|
8.46 | PE | Kochi, 1980 | Vertical value; LLK |

Kovats' RI, non-polar column, isothermal

Column type | Active phase | Temperature (C) | I | Reference | Comment |
---|---|---|---|---|---|
Packed | Apiezon L | 190. | 1355. | Putnam and Pu, 1965 | Celite; Column length: 1. m |

Van Den Dool and Kratz RI, non-polar column, temperature ramp

Column type | Active phase | I | Reference | Comment |
---|---|---|---|---|
Packed | Apiezon L | 1329. | Putnam and Pu, 1965, 2 | Celite, 10. K/min; Column length: 3. m; Tstart: 60. C |
Packed | Apiezon L | 1339. | Putnam and Pu, 1965, 2 | Celite, 15. K/min; Column length: 3. m; Tstart: 60. C |
Packed | Apiezon L | 1327. | Putnam and Pu, 1965, 2 | Celite, 6. K/min; Column length: 3. m; Tstart: 60. C |

References

Martinho Simões
Martinho Simões, J.A.,
Private communication (see http://webbook.nist.gov/chemistry/om/). [all data]
Coleman and Skinner, 1966
Coleman, D.J.; Skinner, H.A.,
Thermochemistry of metallic alkyls. Part 15.?Heats of combustion of trimethyl-isopropyl tin, trimethyl-t-butyl tin and tetra-isopropyl tin,
Trans. Faraday Soc., 1966, 62, 1721, https://doi.org/10.1039/tf9666201721
. [all data]
Pedley and Rylance, 1977
Pedley, J.B.; Rylance, J.,
Computer Analysed Thermochemical Data: Organic and Organometallic Compounds, University of Sussex, Brigton, 1977. [all data]
Cox and Pilcher, 1970
Cox, J.D.; Pilcher, G.,
Thermochemistry of Organic and Organometallic Compounds
in Academic Press, New York, 1970. [all data]
Lautsch, Tröber, et al., 1963
Lautsch, W.F.; Tröber, A.; Zimmer, W.; Mehner, L.; Linck, W.; Lehmann, H.M.; Brandenberger, H.; Korner, H.; Metschker, H.-J.; Wagner, K.; Kaden, R.,
Z. Chem., 1963, 3, 415. [all data]
Baev, 2001
Baev, A.K.,
Izv. Vyssh. Uchebn. Zaved., Khim. Khim. Tekhnol., 2001, 44, 1, 3. [all data]
Hawker, 1992
Hawker, Darryl,
Equilibrium vapour pressures of tetraorganostannanes,
Chemosphere, 1992, 25, 4, 427-436, https://doi.org/10.1016/0045-6535(92)90276-W
. [all data]
Kochi, 1980
Kochi, J.K.,
The role of electron transfer and charge transfer in organometallic chemistry,
Pure Appl. Chem., 1980, 52, 571. [all data]
Putnam and Pu, 1965
Putnam, R.C.; Pu, H.,
Retention indices of organotins,
J. Gas Chromatogr., 1965, 3, 5, 160-164, https://doi.org/10.1093/chromsci/3.5.160
. [all data]
Putnam and Pu, 1965, 2
Putnam, R.C.; Pu, H.,
Retention indices of organotins (II),
J. Gas Chromatogr., 1965, 3, 9, 289-293, https://doi.org/10.1093/chromsci/3.9.289
. [all data]