3-Methylbenzyl cyanide
- Formula: C9H9N
- Molecular weight: 131.1745
- IUPAC Standard InChIKey: WOJADIOTNFDWNQ-UHFFFAOYSA-N
- CAS Registry Number: 2947-60-6
- Chemical structure:
View 3d structure (requires JavaScript / HTML 5) - Other names: m-Xylyl cyanide; m-Methylbenzyl cyanide; m-Tolylacetonitrile; m-Methylphenylacetonitrile; 3-Tolylacetonitrile; 3-Methylphenylacetonitrile; Benzeneacetonitrile, 3-methyl-; NSC 20695; 3-Tolylacetic acid nitrile

Phase change data

Data compiled by: Robert L. Brown and Stephen E. Stein
Quantity | Value | Units | Method | Reference | Comment |
---|---|---|---|---|---|
Tboil | 513.7 | K | N/A | Aldrich Chemical Company Inc., 1990 |

Reaction thermochemistry data

Data compiled by: John E. Bartmess
Individual Reactions
C9H8N- + =
By formula: C9H8N- + H+ = C9H9N
Quantity | Value | Units | Method | Reference | Comment |
---|---|---|---|---|---|
ΔrH° | 1468. ± 10. | kJ/mol | G+TS | Taft and Topsom, 1987 | gas phase |
Quantity | Value | Units | Method | Reference | Comment |
ΔrG° | 1440. ± 8.4 | kJ/mol | IMRE | Taft and Topsom, 1987 | gas phase |

Gas phase ion energetics data

Data compiled as indicated in comments:
B - John E. Bartmess
RDSH - Henry M. Rosenstock, Keith Draxl, Bruce W. Steiner, and John T. Herron
Ionization energy determinations
IE (eV) | Method | Reference | Comment |
---|---|---|---|
9.18 ± 0.04 | EI | Buchs, 1970 | RDSH |
De-protonation reactions
C9H8N- + =
By formula: C9H8N- + H+ = C9H9N
Quantity | Value | Units | Method | Reference | Comment |
---|---|---|---|---|---|
ΔrH° | 1468. ± 10. | kJ/mol | G+TS | Taft and Topsom, 1987 | gas phase; B |
Quantity | Value | Units | Method | Reference | Comment |
ΔrG° | 1440. ± 8.4 | kJ/mol | IMRE | Taft and Topsom, 1987 | gas phase; B |

References

Aldrich Chemical Company Inc., 1990
Aldrich Chemical Company Inc.,
Catalog Handbook of Fine Chemicals, Aldrich Chemical Company, Inc., Milwaukee WI, 1990, 1. [all data]
Taft and Topsom, 1987
Taft, R.W.; Topsom, R.D.,
The Nature and Analysis of Substituent Effects,
Prog. Phys. Org. Chem., 1987, 16, 1. [all data]
Buchs, 1970
Buchs, A.,
Etude par spectrometrie de masse de l'ionisation de benzonitriles, de phenylacetonitriles et de N,N-dimethylanilines substitues,
Helv. Chim. Acta, 1970, 53, 2026. [all data]