Germane,triethyl(phenylmethyl)-
- Formula: C13H22Ge
- Molecular weight: 250.95
- IUPAC Standard InChIKey: ZRMBCSNMTPWNOR-UHFFFAOYSA-N
- CAS Registry Number: 2945-41-7
- Chemical structure:
View 3d structure (requires JavaScript / HTML 5) - Permanent link for this species. Use this link for bookmarking this species for future reference.

Gas phase ion energetics data

Data compiled by: Sharon G. Lias, Rhoda D. Levin, and Sherif A. Kafafi
Ionization energy determinations
IE (eV) | Method | Reference | Comment |
---|---|---|---|
8.1 | PE | Schweig, Weidner, et al., 1974 | Vertical value |

References

Schweig, Weidner, et al., 1974
Schweig, A.; Weidner, U.; Manuel, G.,
Theory and application of photoelectron spectroscopy. XLIV. A quantitative account of hyperconjugation in allyl and benzyl compounds of elements of Group IVB,
J. Organomet. Chem., 1974, 67, 4. [all data]