2-Norbornyl bromide
- Formula: C7H11Br
- Molecular weight: 175.066
- IUPAC Standard InChIKey: QXYOAWHKJRWNID-UHFFFAOYSA-N
- CAS Registry Number: 29342-65-2
- Chemical structure:
View 3d structure (requires JavaScript / HTML 5) - Stereoisomers:
- Other names: 2-Bromobicyclo[2.2.1]heptane; 2-Bromo-norbornane; Norbornane, 2-bromo-

Gas phase ion energetics data

Data compiled by: Sharon G. Lias, John E. Bartmess, Joel F. Liebman, John L. Holmes, Rhoda D. Levin, and W. Gary Mallard
Appearance energy determinations
Ion | AE (eV) | Other Products | Method | Reference | Comment |
---|---|---|---|---|---|
C7H11+ | 9.62 | Br | EI | Lossing and Holmes, 1984 |

References

Lossing and Holmes, 1984
Lossing, F.P.; Holmes, J.L.,
Stabilization energy and ion size in carbocations in the gas phase,
J. Am. Chem. Soc., 1984, 106, 6917. [all data]