3-(4-Methoxyphenyl)-5,5-dimethyl-cyclohex-2-en-1-one
- Formula: C15H18O2
- Molecular weight: 230.3022
- IUPAC Standard InChIKey: RUKWRQRZGWDIBR-UHFFFAOYSA-N
- CAS Registry Number: 29339-44-4
- Chemical structure:
View 3d structure (requires JavaScript / HTML 5) - Permanent link for this species. Use this link for bookmarking this species for future reference.

Gas phase ion energetics data

Data compiled as indicated in comments:
LBLHLM - Sharon G. Lias, John E. Bartmess, Joel F. Liebman, John L. Holmes, Rhoda D. Levin, and W. Gary Mallard
Ionization energy determinations
IE (eV) | Method | Reference | Comment |
---|---|---|---|
8.26 | PE | Pfister-Guillouzo, Geribaldi, et al., 1982 | Vertical value; LBLHLM |

References

Pfister-Guillouzo, Geribaldi, et al., 1982
Pfister-Guillouzo, G.; Geribaldi, S.; Gal, J.-F.,
Spectres photoelectroniques de cyclohexene-2-ones-1 diversement substituees en position 3. Correlations avec la reactivite,
Can. J. Chem., 1982, 60, 1163. [all data]