Propargyl radical
- Formula: C3H3
- Molecular weight: 39.0559
- IUPAC Standard InChIKey: DITHIFQMPPCBCU-UHFFFAOYSA-N
- CAS Registry Number: 2932-78-7
- Chemical structure:
View 3d structure (requires JavaScript / HTML 5) - Species with the same structure:

Gas phase thermochemistry data

Quantity | Value | Units | Method | Reference | Comment |
---|---|---|---|---|---|
ΔfH°gas | 339. ± 4. | kJ/mol | N/A | Tsang, 1996 |

Gas phase ion energetics data

Data evaluated as indicated in comments:
HL - Edward P. Hunter and Sharon G. Lias
Data compiled as indicated in comments:
LL - Sharon G. Lias and Joel F. Liebman
LLK - Sharon G. Lias, Rhoda D. Levin, and Sherif A. Kafafi
Quantity | Value | Units | Method | Reference | Comment |
---|---|---|---|---|---|
Proton affinity (review) | 741. | kJ/mol | N/A | Hunter and Lias, 1998 | HL |
Quantity | Value | Units | Method | Reference | Comment |
Gas basicity | 708.5 | kJ/mol | N/A | Hunter and Lias, 1998 | HL |
Quantity | Value | Units | Method | Reference | Comment |
ΔfH°(+) ion | 1180. | kJ/mol | N/A | N/A |
Ionization energy determinations
IE (eV) | Method | Reference | Comment |
---|---|---|---|
8.67 ± 0.02 | PE | Minsek and Chen, 1990 | LL |
8.68 | EI | Lossing, 1972 | LLK |

References

Tsang, 1996
Tsang, W.,
Heats of Formation of Organic Free Radicals by Kinetic Methods
in Energetics of Organic Free Radicals, Martinho Simoes, J.A.; Greenberg, A.; Liebman, J.F., eds., Blackie Academic and Professional, London, 1996, 22-58. [all data]
Hunter and Lias, 1998
Hunter, E.P.; Lias, S.G.,
Evaluated Gas Phase Basicities and Proton Affinities of Molecules: An Update,
J. Phys. Chem. Ref. Data, 1998, 27, 3, 413-656, https://doi.org/10.1063/1.556018
. [all data]
Minsek and Chen, 1990
Minsek, D.W.; Chen, P.,
Photoelectron spectrum of the propargyl radical in a supersonic beam,
J. Phys. Chem., 1990, 94, 8399. [all data]
Lossing, 1972
Lossing, F.P.,
Free radicals by mass spectrometry. XLV. Ionization potentials and heats of formation of C3H3, C3H5, and C4H7 radicals and ions,
Can. J. Chem., 1972, 50, 3973. [all data]