Chromium,pentacarbonyl[(4-chlorophenyl)methoxymethylene]-

Gas phase ion energetics data

Data compiled by: Sharon G. Lias, Rhoda D. Levin, and Sherif A. Kafafi

Ionization energy determinations

IE (eV) Method Reference
7.3 ± 0.1EIFischer, Kreiter, et al., 1971

References

Fischer, Kreiter, et al., 1971
Fischer, E.O.; Kreiter, C.G.; Kollmeier, H.J.; Muller, J.; Fischer, R.D., Ubergangsmetall- carben-komplexe. XXVII. Ringsubstituierte (methoxyphenylcarben)-pentacarbonylchrom(0)- komplexe, J. Organomet. Chem., 1971, 28, 237. [all data]