Mercury, isopropylmethyl-

Gas phase ion energetics data

Data compiled by: Sharon G. Lias, Rhoda D. Levin, and Sherif A. Kafafi

Ionization energy determinations

IE (eV) Method Reference Comment
8.48PENugent, Wu, et al., 1976Vertical value
8.48PEFehlner, Ulman, et al., 1976Vertical value

References

Nugent, Wu, et al., 1976
Nugent, W.A.; Wu, M.M.-H.; Fehlner, T.P.; Kochi, J.K., Enhanced reactivity of exo-norbornyl derivatives. Evidence for σ-participation in the absence of steric effects, J. Chem. Soc., Chem. Commun., 1976, 456. [all data]

Fehlner, Ulman, et al., 1976
Fehlner, T.P.; Ulman, J.; Nugent, W.A.; Kochi, J.K., Effect of alkyl substituents on the first ionization potential and on 5d10 ionization in dialkylmercury compounds, Inorg. Chem., 1976, 15, 2544. [all data]