Mercury, methyl propyl-
- Formula: C4H10Hg
- Molecular weight: 258.71
- IUPAC Standard InChIKey: TWWRWHDYXLDYLH-UHFFFAOYSA-N
- CAS Registry Number: 29138-87-2
- Chemical structure:
View 3d structure (requires JavaScript / HTML 5) - Permanent link for this species. Use this link for bookmarking this species for future reference.

Gas phase ion energetics data

Data compiled by: Sharon G. Lias, Rhoda D. Levin, and Sherif A. Kafafi
Ionization energy determinations
IE (eV) | Method | Reference | Comment |
---|---|---|---|
8.78 | PE | Nugent, Wu, et al., 1976 | Vertical value |

References

Nugent, Wu, et al., 1976
Nugent, W.A.; Wu, M.M.-H.; Fehlner, T.P.; Kochi, J.K.,
Enhanced reactivity of exo-norbornyl derivatives. Evidence for σ-participation in the absence of steric effects,
J. Chem. Soc., Chem. Commun., 1976, 456. [all data]