Tricyclo[10.2.2.2(5,8)]octadeca-5,7,12,14,15,17-hexaene
- Formula: C18H20
- Molecular weight: 236.3514
- IUPAC Standard InChIKey: RUVOYPXKKFOGBH-UHFFFAOYSA-N
- CAS Registry Number: 2913-24-8
- Chemical structure:
View 3d structure (requires JavaScript / HTML 5) - Other names: [3.3]Paracyclophane; [3,3']-Paracyclophane; Tricyclo[10.2.2.25,8]octadeca-5,7,12,14,15,17-hexaene

Gas phase thermochemistry data

Data compiled by: Hussein Y. Afeefy, Joel F. Liebman, and Stephen E. Stein
Quantity | Value | Units | Method | Reference | Comment |
---|---|---|---|---|---|
ΔfH°gas | 129.4 ± 3.7 | kJ/mol | Ccb | Shieh, McNally, et al., 1969 |

Condensed phase thermochemistry data

Data compiled as indicated in comments:
ALS - Hussein Y. Afeefy, Joel F. Liebman, and Stephen E. Stein
DH - Eugene S. Domalski and Elizabeth D. Hearing
Quantity | Value | Units | Method | Reference | Comment |
---|---|---|---|---|---|
ΔfH°solid | 26.2 ± 2.6 | kJ/mol | Ccb | Shieh, McNally, et al., 1969 | ALS |
Quantity | Value | Units | Method | Reference | Comment |
ΔcH°solid | -9967.8 ± 1.8 | kJ/mol | Ccb | Shieh, McNally, et al., 1969 | Corresponding ΔfHºsolid = 26.3 kJ/mol (simple calculation by NIST; no Washburn corrections); ALS |
Constant pressure heat capacity of solid
Cp,solid (J/mol*K) | Temperature (K) | Reference | Comment |
---|---|---|---|
324.3 | 300. | Shieh, McNally, et al., 1969 | Temperatures 300, 318 K.; DH |

Phase change data

Data compiled as indicated in comments:
ALS - Hussein Y. Afeefy, Joel F. Liebman, and Stephen E. Stein
DRB - Donald R. Burgess, Jr.
AC - William E. Acree, Jr., James S. Chickos
Quantity | Value | Units | Method | Reference | Comment |
---|---|---|---|---|---|
ΔsubH° | 103.3 ± 1.0 | kJ/mol | V | Shieh, McNally, et al., 1969 | ALS |
ΔsubH° | 103.2 | kJ/mol | N/A | Shieh, McNally, et al., 1969 | DRB |
Enthalpy of sublimation
ΔsubH (kJ/mol) | Temperature (K) | Method | Reference | Comment |
---|---|---|---|---|
97.8 | 332. | A | Stephenson and Malanowski, 1987 | Based on data from 321. to 343. K.; AC |
103. ± 1. | 332. | ME | Shieh, McNally, et al., 1969 | Based on data from 322. to 343. K. See also Pedley and Rylance, 1977.; AC |
Enthalpy of fusion
ΔfusH (kJ/mol) | Temperature (K) | Reference | Comment |
---|---|---|---|
11.76 | 377. | Shieh, McNally, et al., 1969 | AC |

References

Shieh, McNally, et al., 1969
Shieh, C.; McNally, D.; Boyd, R.H.,
The heats of combustion and strain energies of some cyclophanes,
Tetrahedron, 1969, 3653-3665. [all data]
Stephenson and Malanowski, 1987
Stephenson, Richard M.; Malanowski, Stanislaw,
Handbook of the Thermodynamics of Organic Compounds, 1987, https://doi.org/10.1007/978-94-009-3173-2
. [all data]
Pedley and Rylance, 1977
Pedley, J.B.; Rylance, J.,
, Computer Analysed Thermochemical Data: Organic and Organometallic Compounds, University of Sussex, Brighton, 1977. [all data]