Benzene, 1-chloro-3-isocyanato-
- Formula: C7H4ClNO
- Molecular weight: 153.566
- IUPAC Standard InChIKey: HHIRBXHEYVDUAM-UHFFFAOYSA-N
- CAS Registry Number: 2909-38-8
- Chemical structure:
View 3d structure (requires JavaScript / HTML 5) - Other names: Isocyanic acid, m-chlorophenyl ester; m-Chlorophenyl isocyanate; 1-Chloro-3-isocyanatobenzene; 3-Chlorophenyl isocyanate; 3-Chloroisocyanatobenzene; m-Chlorfenylisokyanat

Condensed phase thermochemistry data

Data compiled as indicated in comments:
ALS - Hussein Y. Afeefy, Joel F. Liebman, and Stephen E. Stein
DH - Eugene S. Domalski and Elizabeth D. Hearing
Quantity | Value | Units | Method | Reference | Comment |
---|---|---|---|---|---|
ΔcH°liquid | -3277. ± 64. | kJ/mol | Ccb | Zalikin, Kochetkov, et al., 1965 | ALS |
Quantity | Value | Units | Method | Reference | Comment |
ΔfH°solid | -82.8 ± 4.2 | kJ/mol | Ccb | Selivanov and Konstantinov, 1975 | ALS |
Quantity | Value | Units | Method | Reference | Comment |
ΔcH°solid | -3264. ± 4.2 | kJ/mol | Ccb | Selivanov and Konstantinov, 1975 | ALS |
Constant pressure heat capacity of liquid
Cp,liquid (J/mol*K) | Temperature (K) | Reference | Comment |
---|---|---|---|
187.0 | 294.2 | Zalikin, Kochetkov, et al., 1965 | T = 294, 323 K.; DH |

Phase change data

Data compiled as indicated in comments:
ALS - Hussein Y. Afeefy, Joel F. Liebman, and Stephen E. Stein
AC - William E. Acree, Jr., James S. Chickos
Quantity | Value | Units | Method | Reference | Comment |
---|---|---|---|---|---|
ΔvapH° | 54.0 ± 0.2 | kJ/mol | V | Zalikin, Kochetkov, et al., 1965 | ALS |
Enthalpy of vaporization
ΔvapH (kJ/mol) | Temperature (K) | Method | Reference | Comment |
---|---|---|---|---|
53.1 | 359. | A | Stephenson and Malanowski, 1987 | Based on data from 344. to 432. K. See also Goldberg, Gorbushchenkov, et al., 1964.; AC |
Antoine Equation Parameters
log10(P) = A − (B / (T + C))
P = vapor pressure (bar)
T = temperature (K)
View plot Requires a JavaScript / HTML 5 canvas capable browser.
Temperature (K) | A | B | C | Reference | Comment |
---|---|---|---|---|---|
303. to 388. | 2.86234 | 1067.251 | -126.851 | Zalikin, Kochetkov, et al., 1965 | Coefficents calculated by NIST from author's data. |
344. to 431.5 | 3.59906 | 1325.111 | -111.257 | Goldberg, Gorbushchenkov, et al., 1964, 2 | Coefficents calculated by NIST from author's data. |

Reaction thermochemistry data

Data compiled by: Hussein Y. Afeefy, Joel F. Liebman, and Stephen E. Stein
Individual Reactions
By formula: C13H10Cl2N2O = C6H6ClN + C7H4ClNO
Quantity | Value | Units | Method | Reference | Comment |
---|---|---|---|---|---|
ΔrH° | 122.0 ± 5.3 | kJ/mol | Eqk | Chimishkyan, Svetlova, et al., 1984 | solid phase; Dissociation |
By formula: C9H11ClN2O = C2H7N + C7H4ClNO
Quantity | Value | Units | Method | Reference | Comment |
---|---|---|---|---|---|
ΔrH° | 148.0 ± 1.8 | kJ/mol | Eqk | Chimishkyan, Svetlova, et al., 1984 | solid phase; Dissociation |

Gas phase ion energetics data

Data compiled by: Sharon G. Lias, Rhoda D. Levin, and Sherif A. Kafafi
Ionization energy determinations
IE (eV) | Method | Reference | Comment |
---|---|---|---|
9.0 ± 0.1 | PE | Neijzen and DeLange, 1980 | Vertical value |

References

Zalikin, Kochetkov, et al., 1965
Zalikin, A.A.; Kochetkov, V.L.; Strepikheev, Yu.A.,
Some physical and physicochemical constants of m- and p-chloroaniline and of m- and p-chlorophenyl isocyanate,
Khim. Prom. (Moscow), 1965, 41, 338. [all data]
Selivanov and Konstantinov, 1975
Selivanov, V.D.; Konstantinov, I.I.,
Thermochemistry of chloroaryl isocyanates,
Russ. J. Phys. Chem. (Engl. Transl.), 1975, 49, 620-621. [all data]
Stephenson and Malanowski, 1987
Stephenson, Richard M.; Malanowski, Stanislaw,
Handbook of the Thermodynamics of Organic Compounds, 1987, https://doi.org/10.1007/978-94-009-3173-2
. [all data]
Goldberg, Gorbushchenkov, et al., 1964
Goldberg, N.A.; Gorbushchenkov, V.A.; Teplova, Z.G.,
Zh. Prikl. Khim. (S.-Peterburg), 1964, 37, 745. [all data]
Goldberg, Gorbushchenkov, et al., 1964, 2
Goldberg, N.A.; Gorbushchenkov, V.A.; Teplova, Z.G.,
Some Physical Property of m-Chlorphenyl Isocyonate,
Zh. Prikl. Khim. (Leningrad), 1964, 37, 745-747. [all data]
Chimishkyan, Svetlova, et al., 1984
Chimishkyan, A.L.; Svetlova, L.P.; Leonova, T.V.; Gluyaev, N.D.,
Thermal decomposition of substituted ureas,
J. Gen. Chem. USSR, 1984, 54, 1317-1320. [all data]
Neijzen and DeLange, 1980
Neijzen, B.J.M.; DeLange, C.A.,
Photoelectron spectroscopy of some thiocyanates, isocyanates and isothiocyanates,
J. Electron Spectrosc. Relat. Phenom., 1980, 18, 179. [all data]