Benzeneethanamine, dimethyl-
- Formula: C10H15N
- Molecular weight: 149.2328
- IUPAC Standard InChIKey: MYWUZJCMWCOHBA-UHFFFAOYSA-N
- CAS Registry Number: 29088-49-1
- Chemical structure:
View 3d structure (requires JavaScript / HTML 5) - Species with the same structure:
- Stereoisomers:

Gas phase ion energetics data

Data compiled by: Sharon G. Lias, Rhoda D. Levin, and Sherif A. Kafafi
Ionization energy determinations
IE (eV) | Method | Reference |
---|---|---|
7.70 | PI | Akopyan, Vilesov, et al., 1975 |
Appearance energy determinations
Ion | AE (eV) | Other Products | Method | Reference | Comment |
---|---|---|---|---|---|
C2H6N+ | 8.50 | C6H5C2H4 | PI | Akopyan, Vilesov, et al., 1975 | |
C3H8N+ | 8.17 | C6H5CH2 | PI | Akopyan, Vilesov, et al., 1975 | |
C6H5+ | 10.55 | C4H10N | PI | Akopyan, Vilesov, et al., 1975 | |
C7H7+ | 10.55 | C3H8N | PI | Akopyan, Vilesov, et al., 1975 |

References

Akopyan, Vilesov, et al., 1975
Akopyan, M.E.; Vilesov, F.I.; Loginov, Y.V.,
Photoionization of amines and the monomolecular decomposition of excited molecular ions,
Khim. Vys. Energ., 1975, 9, 327. [all data]