1,4-Dithiin
- Formula: C4H4S2
- Molecular weight: 116.205
- IUPAC Standard InChIKey: AKAIWNDBVZJOAJ-UHFFFAOYSA-N
- CAS Registry Number: 290-79-9
- Chemical structure:
View 3d structure (requires JavaScript / HTML 5) - Permanent link for this species. Use this link for bookmarking this species for future reference.

Gas phase ion energetics data

Data compiled as indicated in comments:
LLK - Sharon G. Lias, Rhoda D. Levin, and Sherif A. Kafafi
Ionization energy determinations
IE (eV) | Method | Reference | Comment |
---|---|---|---|
7.7 | PE | Colonna, Distefano, et al., 1980 | LLK |
8.1 ± 0.1 | PE | Colonna, Distefano, et al., 1980 | Vertical value; LLK |

References

Colonna, Distefano, et al., 1980
Colonna, F.P.; Distefano, G.; Galasso, V.,
Photoelectron spectra of 1,4-dithiin and related compounds,
J. Electron Spectrosc. Relat. Phenom., 1980, 18, 75. [all data]