3-Hexene, 2,2,5,5-tetramethyl-3,4-bis(1,1-dimethylethyl)-
- Formula: C14H28
- Molecular weight: 196.3721
- IUPAC Standard InChIKey: WXTSAYDLWHISDR-UHFFFAOYSA-N
- CAS Registry Number: 28923-90-2
- Chemical structure:
View 3d structure (requires JavaScript / HTML 5) - Permanent link for this species. Use this link for bookmarking this species for future reference.

Gas phase ion energetics data

Data compiled as indicated in comments:
LLK - Sharon G. Lias, Rhoda D. Levin, and Sherif A. Kafafi
Ionization energy determinations
IE (eV) | Method | Reference | Comment |
---|---|---|---|
8.169 ± 0.012 | PE | Masclet, Grosjean, et al., 1973 | LLK |

References

Masclet, Grosjean, et al., 1973
Masclet, P.; Grosjean, D.; Mouvier, G.,
Alkene ionization potentials. Part I. Quantitative determination of alkyl group structural effects,
J. Electron Spectrosc. Relat. Phenom., 1973, 2, 225. [all data]