1H-Tetrazole
- Formula: CH2N4
- Molecular weight: 70.0534
- IUPAC Standard InChIKey: KJUGUADJHNHALS-UHFFFAOYSA-N
- CAS Registry Number: 288-94-8
- Chemical structure:
View 3d structure (requires JavaScript / HTML 5) - Species with the same structure:
- Other names: Tetraazacyclopentadiene; Tetrazole

Gas phase thermochemistry data

Data compiled as indicated in comments:
ALS - Hussein Y. Afeefy, Joel F. Liebman, and Stephen E. Stein
DRB - Donald R. Burgess, Jr.
Quantity | Value | Units | Method | Reference | Comment |
---|---|---|---|---|---|
ΔfH°gas | 320. ± 3. | kJ/mol | Ccb | Balepin, Lebedev, et al., 1977 | ALS |
ΔfH°gas | 321.1 | kJ/mol | N/A | McEwan and Rigg, 1951 | Value computed using ΔfHsolid° value of 237.1 kj/mol from McEwan and Rigg, 1951 and ΔsubH° value of 84.0 kj/mol from Balepin, Lebedev, et al., 1977.; DRB |

Condensed phase thermochemistry data

Data compiled as indicated in comments:
ALS - Hussein Y. Afeefy, Joel F. Liebman, and Stephen E. Stein
DH - Eugene S. Domalski and Elizabeth D. Hearing
Quantity | Value | Units | Method | Reference | Comment |
---|---|---|---|---|---|
ΔfH°solid | 236. ± 0.4 | kJ/mol | Ccb | Balepin, Lebedev, et al., 1977 | ALS |
ΔfH°solid | 237.1 | kJ/mol | Ccb | McEwan and Rigg, 1951 | ALS |
Quantity | Value | Units | Method | Reference | Comment |
ΔcH°solid | -915.5 ± 0.4 | kJ/mol | Ccb | Balepin, Lebedev, et al., 1977 | ALS |
ΔcH°solid | -916.3 | kJ/mol | Ccb | Zimmerman and Geisenfelder, 1961 | ALS |
ΔcH°solid | -916.42 ± 0.88 | kJ/mol | Ccb | McEwan and Rigg, 1951 | ALS |
Quantity | Value | Units | Method | Reference | Comment |
S°solid,1 bar | 96.36 | J/mol*K | N/A | Kabo, Kozyro, et al., 1993 | crystaline, I phase; DH |
Constant pressure heat capacity of solid
Cp,solid (J/mol*K) | Temperature (K) | Reference | Comment |
---|---|---|---|
76.52 | 298.15 | Kabo, Kozyro, et al., 1993 | crystaline, I phase; T = 5 to 320 K.; DH |

Phase change data

Data compiled as indicated in comments:
TRC - Thermodynamics Research Center, NIST Boulder Laboratories, Chris Muzny director
ALS - Hussein Y. Afeefy, Joel F. Liebman, and Stephen E. Stein
DRB - Donald R. Burgess, Jr.
AC - William E. Acree, Jr., James S. Chickos
DH - Eugene S. Domalski and Elizabeth D. Hearing
Quantity | Value | Units | Method | Reference | Comment |
---|---|---|---|---|---|
Tfus | 430.7 | K | N/A | Hilgeman, Mouroux, et al., 1989 | Uncertainty assigned by TRC = 0.4 K; TRC |
Quantity | Value | Units | Method | Reference | Comment |
Ttriple | 430. | K | N/A | Kabo, Kozyro, et al., 1993, 2 | Crystal phase 1 phase; Uncertainty assigned by TRC = 1. K; TRC |
Ttriple | 429. | K | N/A | Kozyro, Simirskii, et al., 1990 | Uncertainty assigned by TRC = 1. K; Det. with triple heat bridge; TRC |
Quantity | Value | Units | Method | Reference | Comment |
ΔsubH° | 85. ± 3. | kJ/mol | V | Balepin, Lebedev, et al., 1977 | ALS |
ΔsubH° | 84.0 | kJ/mol | N/A | Balepin, Lebedev, et al., 1977 | DRB |
ΔsubH° | 97.5 | kJ/mol | V | Zimmerman and Geisenfelder, 1961 | ALS |
Enthalpy of sublimation
ΔsubH (kJ/mol) | Temperature (K) | Method | Reference | Comment |
---|---|---|---|---|
88.16 | 353. | C | Kabo, Kozyro, et al., 1993 | AC |
87.8 ± 1.4 | 369. | ME | Kabo, Kozyro, et al., 1993 | AC |
88.0 ± 1.6 | 333. to 404. | ME | Kozyro, Simirskii, et al., 1990, 2 | AC |
97.32 | 333. | V | McEwan and Rigg, 1951 | ALS |
97.5 ± 4.2 | 348. | ME | McEwan and Rigg, 1951 | Based on data from 333. to 363. K. See also Cox and Pilcher, 1970.; AC |
Enthalpy of fusion
ΔfusH (kJ/mol) | Temperature (K) | Reference | Comment |
---|---|---|---|
18.400 | 430.7 | Hilgeman, Mouroux, et al., 1989, 2 | DH |
17.7 | 432.1 | Kozyro, Simirskii, et al., 1990, 3 | AC |
Enthalpy of phase transition
ΔHtrs (kJ/mol) | Temperature (K) | Initial Phase | Final Phase | Reference | Comment |
---|---|---|---|---|---|
0.0140 | 242.5 | crystaline, II | crystaline, I | Kabo, Kozyro, et al., 1993 | DH |
18.000 | 430. | crystaline, I | liquid | Kabo, Kozyro, et al., 1993 | DH |
88.160 | 353.1 | crystaline, I | Kabo, Kozyro, et al., 1993 | DH |
Entropy of phase transition
ΔStrs (J/mol*K) | Temperature (K) | Initial Phase | Final Phase | Reference | Comment |
---|---|---|---|---|---|
0.060 | 242.5 | crystaline, II | crystaline, I | Kabo, Kozyro, et al., 1993 | DH |
41.9 | 430. | crystaline, I | liquid | Kabo, Kozyro, et al., 1993 | DH |
250. | 353.1 | crystaline, I | Kabo, Kozyro, et al., 1993 | DH |

Reaction thermochemistry data

Data compiled as indicated in comments:
B - John E. Bartmess
ALS - Hussein Y. Afeefy, Joel F. Liebman, and Stephen E. Stein
Individual Reactions
CHN4- + =
By formula: CHN4- + H+ = CH2N4
Quantity | Value | Units | Method | Reference | Comment |
---|---|---|---|---|---|
ΔrH° | 1396. ± 8.8 | kJ/mol | G+TS | Taft, 1991 | gas phase; B |
Quantity | Value | Units | Method | Reference | Comment |
ΔrG° | 1366. ± 8.4 | kJ/mol | IMRE | Taft, 1991 | gas phase; B |
By formula: C3H4N4O + H2O = CH2N4 + C2H4O2
Quantity | Value | Units | Method | Reference | Comment |
---|---|---|---|---|---|
ΔrH° | -43.1 ± 0.4 | kJ/mol | Cm | Wadso, 1960 | solid phase; Heat of hydrolysis; ALS |
By formula: C3H4N4O + C6H7N = C8H9NO + CH2N4
Quantity | Value | Units | Method | Reference | Comment |
---|---|---|---|---|---|
ΔrH° | -84.6 ± 0.3 | kJ/mol | Cm | Wadso, 1962 | solid phase; ALS |

Gas phase ion energetics data

Data compiled as indicated in comments:
B - John E. Bartmess
LL - Sharon G. Lias and Joel F. Liebman
LLK - Sharon G. Lias, Rhoda D. Levin, and Sherif A. Kafafi
Ionization energy determinations
IE (eV) | Method | Reference | Comment |
---|---|---|---|
10.95 | PE | Palmer, Simpson, et al., 1981 | LLK |
11.3 | PE | Guimon, Khayar, et al., 1989 | Vertical value; LL |
11.0 | PE | Palmer, Simpson, et al., 1981 | Vertical value; LLK |
11.3 | PE | Cradock, Findlay, et al., 1973 | Vertical value; LLK |
De-protonation reactions
CHN4- + =
By formula: CHN4- + H+ = CH2N4
Quantity | Value | Units | Method | Reference | Comment |
---|---|---|---|---|---|
ΔrH° | 1396. ± 8.8 | kJ/mol | G+TS | Taft, 1991 | gas phase; B |
Quantity | Value | Units | Method | Reference | Comment |
ΔrG° | 1366. ± 8.4 | kJ/mol | IMRE | Taft, 1991 | gas phase; B |

References

Balepin, Lebedev, et al., 1977
Balepin, A.A.; Lebedev, V.P.; Miroshnichenko, E.A.; Koldobskii, G.I.; Ostovskii, V.A.; Larionov, B.P.; Gidaspov, B.V.; Lebedev, Yu.A.,
Energy effects in polyphenylenes and phenyltetrazoles,
Svoistva Veshchestv Str. Mol., 1977, 93-98. [all data]
McEwan and Rigg, 1951
McEwan, W.S.; Rigg, M.W.,
The heats of combustion of compounds containing the tetrazole ring,
J. Am. Chem. Soc., 1951, 73, 4725-4727. [all data]
Zimmerman and Geisenfelder, 1961
Zimmerman, H.; Geisenfelder, H.,
Uber die Mesomerieenergie von Azolen,
Z. Electrochem., 1961, 65, 368-371. [all data]
Kabo, Kozyro, et al., 1993
Kabo, G.J.; Kozyro, A.A.; Krasulin, A.P.; Sevruk, V.M.; Ivashkevich, L.S.,
Thermodynamic properties and tautomerism of tetrazole,
J. Chem. Thermodynam., 1993, 25, 485-493. [all data]
Hilgeman, Mouroux, et al., 1989
Hilgeman, F.R.; Mouroux, F.Y.N.; Mok, D.; Holan, M.K.,
Phase Diagrams of Binary Solid Azole Systems,
J. Chem. Eng. Data, 1989, 34, 220. [all data]
Kabo, Kozyro, et al., 1993, 2
Kabo, G.Ya.; Kozyro, A.A.; Krasulin, A.P.; Sevruk, V.M.; Ivashkevich, L.S.,
Thermodynamic properties and tautomerism of tetrazole,
J. Chem. Thermodyn., 1993, 25, 485. [all data]
Kozyro, Simirskii, et al., 1990
Kozyro, A.A.; Simirskii, V.V.; Kabo, G.Y.; Frenkel, M.L.; Krasulin, A.P.; Sevruk, V.M.; Sokolov, N.A.,
Additivity of the thermochemical characteristics of tetraalklyl-substituted carbamides,
Zh. Fiz. Khim., 1990, 64, 2360. [all data]
Kozyro, Simirskii, et al., 1990, 2
Kozyro, A.A.; Simirskii, V.V.; Krasulin, A.P.; Sevruk, V.M.; Kabo, G.Y.; Frenkel, M.L.; Gaponik, P.N.; Grigor'ev, Y.V.,
Russ. J. Phys. Chem., 1990, 64, 348. [all data]
Cox and Pilcher, 1970
Cox, J.D.; Pilcher, G.,
Thermochemistry of Organic and Organometallic Compounds, Academic Press Inc., London, 1970, 643. [all data]
Hilgeman, Mouroux, et al., 1989, 2
Hilgeman, F.R.; Mouroux, F.Y.N.; Mok, D.; Holan, M.K.,
Phase diagrams of binary solid azole systems,
J. Chem. Eng. Data, 1989, 34, 220-222. [all data]
Kozyro, Simirskii, et al., 1990, 3
Kozyro, A.A.; Simirskii, V.V.; Krasulin, A.P.; Sevruk, V.M.; Kabo, G.Y.; Frenkel, M.L.; Gaponik, P.N.; Grigor'ev, Y.V.,
Thermodynamic properties of tetrazole derivatives in different aggregation states,
Zh. Fiz. Khim., 1990, 64, 656. [all data]
Taft, 1991
Taft, R.W.,
, personal communication, Aug, 1991. [all data]
Wadso, 1960
Wadso, I.,
Heats of hydrolysis of N-acetylated imidazole, 1,2,4-triazole and tetrazole,
Acta Chem. Scand., 1960, 14, 903-908. [all data]
Wadso, 1962
Wadso, I.,
Heats of aminolysis and hydrolysis of some N-acetyl compounds and of acetic anhydride,
Acta Chem. Scand., 1962, 16, 471-478. [all data]
Palmer, Simpson, et al., 1981
Palmer, M.H.; Simpson, I.; Wheeler, J.R.,
Gas phase tautomerism in the triazoles and tetrazoles: A study by photoelectron spectroscopy and ab initio molecular orbital calculations,
Z. Naturforsch. A:, 1981, 36, 1246. [all data]
Guimon, Khayar, et al., 1989
Guimon, C.; Khayar, S.; Gracian, F.; Begtrup, M.; Pfister-Guillouzo, G.,
HeI photoelectron and theoretical study of the gas phase flash pyrolysis of tetrazole and analysis of CN2H2 energy hypersurface,
Chem. Phys., 1989, 138, 157. [all data]
Cradock, Findlay, et al., 1973
Cradock, S.; Findlay, R.H.; Palmer, M.H.,
The molecular energy levels of the azoles: A study by photoelectron spectroscopy and ab initio molecular orbital calculations,
Tetrahedron, 1973, 29, 2173. [all data]