1H-1,2,4-Triazole
- Formula: C2H3N3
- Molecular weight: 69.0653
- IUPAC Standard InChIKey: NSPMIYGKQJPBQR-UHFFFAOYSA-N
- CAS Registry Number: 288-88-0
- Chemical structure:
View 3d structure (requires JavaScript / HTML 5) - Species with the same structure:
- Other names: s-Triazole; 1,2,4-Triazole; 1,2,4-1H-Triazole; CGA-71019; Pyrrodiazole

Gas phase thermochemistry data

Data compiled as indicated in comments:
ALS - Hussein Y. Afeefy, Joel F. Liebman, and Stephen E. Stein
DRB - Donald R. Burgess, Jr.
Quantity | Value | Units | Method | Reference | Comment |
---|---|---|---|---|---|
ΔfH°gas | 192.7 ± 0.8 | kJ/mol | Ccb | Jimenez, Roux, et al., 1989 | ALS |
ΔfH°gas | 193.7 ± 1.9 | kJ/mol | Ccb | Faour and Akasheh, 1985 | ALS |
ΔfH°gas | 188.5 | kJ/mol | N/A | Masalitinova, Oleinikova, et al., 1984 | Value computed using ΔfHsolid° value of 107.9±0.5 kj/mol from Masalitinova, Oleinikova, et al., 1984 and ΔsubH° value of 80.6 kj/mol from Jimenez, Roux, et al., 1989.; DRB |
ΔfH°gas | 189.8 | kJ/mol | N/A | Aleksandrov, Osipova, et al., 1982 | Value computed using ΔfHsolid° value of 109.2±0.9 kj/mol from Aleksandrov, Osipova, et al., 1982 and ΔsubH° value of 80.6 kj/mol from Jimenez, Roux, et al., 1989.; DRB |

Condensed phase thermochemistry data

Data compiled as indicated in comments:
ALS - Hussein Y. Afeefy, Joel F. Liebman, and Stephen E. Stein
DH - Eugene S. Domalski and Elizabeth D. Hearing
Quantity | Value | Units | Method | Reference | Comment |
---|---|---|---|---|---|
ΔfH°solid | 108.7 ± 0.4 | kJ/mol | Ccb | Jimenez, Roux, et al., 1989 | ALS |
ΔfH°solid | 113.1 ± 1.4 | kJ/mol | Ccb | Faour and Akasheh, 1985 | ALS |
ΔfH°solid | 107.89 ± 0.46 | kJ/mol | Ccb | Masalitinova, Oleinikova, et al., 1984 | ALS |
ΔfH°solid | 109.22 ± 0.94 | kJ/mol | Ccb | Aleksandrov, Osipova, et al., 1982 | ALS |
Quantity | Value | Units | Method | Reference | Comment |
ΔcH°solid | -1324.4 ± 0.3 | kJ/mol | Ccb | Jimenez, Roux, et al., 1989 | ALS |
ΔcH°solid | -1328.9 ± 1.2 | kJ/mol | Ccb | Faour and Akasheh, 1985 | ALS |
ΔcH°solid | -1323.66 ± 0.37 | kJ/mol | Ccb | Masalitinova, Oleinikova, et al., 1984 | ALS |
ΔcH°solid | -1324.99 ± 0.90 | kJ/mol | Ccb | Aleksandrov, Osipova, et al., 1982 | ALS |
ΔcH°solid | -1325. | kJ/mol | Ccb | Zimmerman and Geisenfelder, 1961 | ALS |
Constant pressure heat capacity of solid
Cp,solid (J/mol*K) | Temperature (K) | Reference | Comment |
---|---|---|---|
78.7 | 298.15 | Jimenez, Roux, et al., 1989 | DH |

Phase change data

Data compiled as indicated in comments:
BS - Robert L. Brown and Stephen E. Stein
TRC - Thermodynamics Research Center, NIST Boulder Laboratories, Chris Muzny director
AC - William E. Acree, Jr., James S. Chickos
ALS - Hussein Y. Afeefy, Joel F. Liebman, and Stephen E. Stein
DRB - Donald R. Burgess, Jr.
DH - Eugene S. Domalski and Elizabeth D. Hearing
Quantity | Value | Units | Method | Reference | Comment |
---|---|---|---|---|---|
Tboil | 533.2 | K | N/A | Aldrich Chemical Company Inc., 1990 | BS |
Tboil | 477.15 | K | N/A | Bruhl, 1895 | Uncertainty assigned by TRC = 1.5 K; TRC |
Quantity | Value | Units | Method | Reference | Comment |
Tfus | 393.5 | K | N/A | Hilgeman, Mouroux, et al., 1989 | Uncertainty assigned by TRC = 0.4 K; TRC |
Tfus | 392. | K | N/A | Vorontsova and Vlasov, 1987 | Crystal phase 1 phase; Uncertainty assigned by TRC = 0.5 K; TRC |
Tfus | 295.15 | K | N/A | Bruhl, 1895 | Uncertainty assigned by TRC = 1.5 K; TRC |
Quantity | Value | Units | Method | Reference | Comment |
ΔsubH° | 83. ± 3. | kJ/mol | AVG | N/A | Average of 6 values; Individual data points |
Enthalpy of fusion
ΔfusH (kJ/mol) | Temperature (K) | Reference | Comment |
---|---|---|---|
16.100 | 393.5 | Hilgeman, Mouroux, et al., 1989, 2 | DH |
10.76 ± 0.08 | 393.3 | Sabbah and Perez, 1999 | AC |
16.1 | 393.5 | Domalski and Hearing, 1996 | AC |

Reaction thermochemistry data

Data compiled as indicated in comments:
B - John E. Bartmess
RCD - Robert C. Dunbar
ALS - Hussein Y. Afeefy, Joel F. Liebman, and Stephen E. Stein
Individual Reactions
C2H2N3- + =
By formula: C2H2N3- + H+ = C2H3N3
Quantity | Value | Units | Method | Reference | Comment |
---|---|---|---|---|---|
ΔrH° | 1440. ± 8.8 | kJ/mol | G+TS | Taft, 1991 | gas phase; B |
Quantity | Value | Units | Method | Reference | Comment |
ΔrG° | 1410. ± 8.4 | kJ/mol | IMRE | Taft, 1991 | gas phase; B |
By formula: Na+ + C2H3N3 = (Na+ • C2H3N3)
Quantity | Value | Units | Method | Reference | Comment |
---|---|---|---|---|---|
ΔrH° | 124. ± 5.0 | kJ/mol | CIDT | Rodgers and Armentrout, 2000 | RCD |
Free energy of reaction
ΔrG° (kJ/mol) | T (K) | Method | Reference | Comment |
---|---|---|---|---|
0.0 | 0. | CIDT | Rodgers and Armentrout, 2000 | RCD |
By formula: C4H5N3O + H2O = C2H3N3 + C2H4O2
Quantity | Value | Units | Method | Reference | Comment |
---|---|---|---|---|---|
ΔrH° | -30.5 ± 0.3 | kJ/mol | Cm | Wadso, 1960 | solid phase; Heat of hydrolysis; ALS |
By formula: C4H11N + C4H5N3O = C6H13NO + C2H3N3
Quantity | Value | Units | Method | Reference | Comment |
---|---|---|---|---|---|
ΔrH° | -85.8 ± 0.3 | kJ/mol | Cm | Wadso, 1962 | solid phase; ALS |
By formula: C2H3N3 = C2H3N3
Quantity | Value | Units | Method | Reference | Comment |
---|---|---|---|---|---|
ΔrH° | 12. | kJ/mol | Eqk | Mauret, Fayet, et al., 1973 | liquid phase; solvent: Benzene; ALS |
By formula: C4H5N3O + C6H7N = C8H9NO + C2H3N3
Quantity | Value | Units | Method | Reference | Comment |
---|---|---|---|---|---|
ΔrH° | -72.3 ± 0.3 | kJ/mol | Cm | Wadso, 1962 | solid phase; ALS |
By formula: Li+ + C2H3N3 = (Li+ • C2H3N3)
Quantity | Value | Units | Method | Reference | Comment |
---|---|---|---|---|---|
ΔrH° | 191. ± 7.9 | kJ/mol | CIDT | Rodgers and Armentrout, 2000 | RCD |
By formula: K+ + C2H3N3 = (K+ • C2H3N3)
Quantity | Value | Units | Method | Reference | Comment |
---|---|---|---|---|---|
ΔrH° | 87.0 ± 5.0 | kJ/mol | CIDT | Rodgers and Armentrout, 2000 | RCD |

Gas phase ion energetics data

Data evaluated as indicated in comments:
HL - Edward P. Hunter and Sharon G. Lias
Data compiled as indicated in comments:
B - John E. Bartmess
LLK - Sharon G. Lias, Rhoda D. Levin, and Sherif A. Kafafi
Quantity | Value | Units | Method | Reference | Comment |
---|---|---|---|---|---|
Proton affinity (review) | 886.0 | kJ/mol | N/A | Hunter and Lias, 1998 | HL |
Quantity | Value | Units | Method | Reference | Comment |
Gas basicity | 855.9 | kJ/mol | N/A | Hunter and Lias, 1998 | HL |
Ionization energy determinations
IE (eV) | Method | Reference | Comment |
---|---|---|---|
9.8 | PE | Palmer, Simpson, et al., 1981 | LLK |
10.1 | PE | Palmer, Simpson, et al., 1981 | Vertical value; LLK |
10.6 | PE | Guimon, Pfister-Guillouzo, et al., 1980 | Vertical value; LLK |
10.0 | PE | Cradock, Findlay, et al., 1973 | Vertical value; LLK |
De-protonation reactions
C2H2N3- + =
By formula: C2H2N3- + H+ = C2H3N3
Quantity | Value | Units | Method | Reference | Comment |
---|---|---|---|---|---|
ΔrH° | 1440. ± 8.8 | kJ/mol | G+TS | Taft, 1991 | gas phase; B |
Quantity | Value | Units | Method | Reference | Comment |
ΔrG° | 1410. ± 8.4 | kJ/mol | IMRE | Taft, 1991 | gas phase; B |

Ion clustering data

Data compiled by: Robert C. Dunbar
Clustering reactions
By formula: K+ + C2H3N3 = (K+ • C2H3N3)
Quantity | Value | Units | Method | Reference | Comment |
---|---|---|---|---|---|
ΔrH° | 87.0 ± 5.0 | kJ/mol | CIDT | Rodgers and Armentrout, 2000 |
By formula: Li+ + C2H3N3 = (Li+ • C2H3N3)
Quantity | Value | Units | Method | Reference | Comment |
---|---|---|---|---|---|
ΔrH° | 191. ± 7.9 | kJ/mol | CIDT | Rodgers and Armentrout, 2000 |
By formula: Na+ + C2H3N3 = (Na+ • C2H3N3)
Quantity | Value | Units | Method | Reference | Comment |
---|---|---|---|---|---|
ΔrH° | 124. ± 5.0 | kJ/mol | CIDT | Rodgers and Armentrout, 2000 |
Free energy of reaction
ΔrG° (kJ/mol) | T (K) | Method | Reference |
---|---|---|---|
0.0 | 0. | CIDT | Rodgers and Armentrout, 2000 |

Kovats' RI, non-polar column, isothermal

Column type | Active phase | Temperature (C) | I | Reference | Comment |
---|---|---|---|---|---|
Capillary | OV-101 | 110. | 1116. | Zhuravleva, 2000 | 50. m/0.3 mm/0.4 μm, He |
Capillary | OV-101 | 110. | 1116. | Golovnya, Kuz'menko, et al., 1999 | 50. m/0.3 mm/0.4 μm, He |

References

Jimenez, Roux, et al., 1989
Jimenez, P.; Roux, M.V.; Turrion, C.,
Thermochemical properties of N-heterocyclic compounds II. Enthalpies of combustion, vapour pressures, enthalpies of sublimation, and enthalpies of formation of 1,2,4-triazole and benzotriazole,
J. Chem. Thermodyn., 1989, 21, 759-764. [all data]
Faour and Akasheh, 1985
Faour, M.; Akasheh, T.S.,
Heat of combustion of some N-heterocycle compounds. Part 1,
J. Chem. Soc. Perkin Trans. 2, 1985, 811-713. [all data]
Masalitinova, Oleinikova, et al., 1984
Masalitinova, T.N.; Oleinikova, T.P.; Polyakova, L.P.,
Thermochemical study of 1,2,4-triazole as a reference substnace for the calorimetry of combustion of organonitrogen compounds,
Ref. Zh., Khim.; Abstr. No. 7B3028, 1984, 0. [all data]
Aleksandrov, Osipova, et al., 1982
Aleksandrov, Yu.I.; Osipova, T.R.; Yuhkevich, V.F.,
Study of 1,2,4-triazole as a standard sample in the calorimetry of thoroughly nitrided organic compounds,
Termodin. Organ. Soedin., 1982, 42-45. [all data]
Zimmerman and Geisenfelder, 1961
Zimmerman, H.; Geisenfelder, H.,
Uber die Mesomerieenergie von Azolen,
Z. Electrochem., 1961, 65, 368-371. [all data]
Aldrich Chemical Company Inc., 1990
Aldrich Chemical Company Inc.,
Catalog Handbook of Fine Chemicals, Aldrich Chemical Company, Inc., Milwaukee WI, 1990, 1. [all data]
Bruhl, 1895
Bruhl, J.W.,
Spectrochemistry of Nitrogen-Containing Compounds. I.,
Z. Phys. Chem., Stoechiom. Verwandtschaftsl., 1895, 16, 193. [all data]
Hilgeman, Mouroux, et al., 1989
Hilgeman, F.R.; Mouroux, F.Y.N.; Mok, D.; Holan, M.K.,
Phase Diagrams of Binary Solid Azole Systems,
J. Chem. Eng. Data, 1989, 34, 220. [all data]
Vorontsova and Vlasov, 1987
Vorontsova, N.A.; Vlasov, O.N.,
Determination of saturated vapor pressure of Bayletone and its semiproducts,
Deposited Doc. ONIITEkhim Cherkassy, 1987, Doc. No. 1423 khp - 87, 1987. [all data]
Hilgeman, Mouroux, et al., 1989, 2
Hilgeman, F.R.; Mouroux, F.Y.N.; Mok, D.; Holan, M.K.,
Phase diagrams of binary solid azole systems,
J. Chem. Eng. Data, 1989, 34, 220-222. [all data]
Sabbah and Perez, 1999
Sabbah, Raphaël; Perez, Laurence,
Energetics of Intramolecular Bonds in 1H-1,2,4-Triazole and 1H-Benzotriazole,
Aust. J. Chem., 1999, 52, 4, 235-621, https://doi.org/10.1071/C99006
. [all data]
Domalski and Hearing, 1996
Domalski, Eugene S.; Hearing, Elizabeth D.,
Heat Capacities and Entropies of Organic Compounds in the Condensed Phase. Volume III,
J. Phys. Chem. Ref. Data, 1996, 25, 1, 1, https://doi.org/10.1063/1.555985
. [all data]
Taft, 1991
Taft, R.W.,
, personal communication, Aug, 1991. [all data]
Rodgers and Armentrout, 2000
Rodgers, M.T.; Armentrout, P.B.,
Noncovalent Metal-Ligand Bond Energies as Studied by Threshold Collision-Induced Dissociation,
Mass Spectrom. Rev., 2000, 19, 4, 215, https://doi.org/10.1002/1098-2787(200007)19:4<215::AID-MAS2>3.0.CO;2-X
. [all data]
Wadso, 1960
Wadso, I.,
Heats of hydrolysis of N-acetylated imidazole, 1,2,4-triazole and tetrazole,
Acta Chem. Scand., 1960, 14, 903-908. [all data]
Wadso, 1962
Wadso, I.,
Heats of aminolysis and hydrolysis of some N-acetyl compounds and of acetic anhydride,
Acta Chem. Scand., 1962, 16, 471-478. [all data]
Mauret, Fayet, et al., 1973
Mauret, P.; Fayet, J.P.; Fabre, M.; Elguero, J.; Pardo, M.d.C.,
Tautomerism study of υ-triazole from dipolar moment measurements,
J. Chim. Phys. Phys.-Chim. Biol., 1973, 70, 1483-1485. [all data]
Hunter and Lias, 1998
Hunter, E.P.; Lias, S.G.,
Evaluated Gas Phase Basicities and Proton Affinities of Molecules: An Update,
J. Phys. Chem. Ref. Data, 1998, 27, 3, 413-656, https://doi.org/10.1063/1.556018
. [all data]
Palmer, Simpson, et al., 1981
Palmer, M.H.; Simpson, I.; Wheeler, J.R.,
Gas phase tautomerism in the triazoles and tetrazoles: A study by photoelectron spectroscopy and ab initio molecular orbital calculations,
Z. Naturforsch. A:, 1981, 36, 1246. [all data]
Guimon, Pfister-Guillouzo, et al., 1980
Guimon, C.; Pfister-Guillouzo, G.; Bernardini, A.; Viallefont, P.,
A photoelectron study (HeI, HeII) of the tautomeric equilibrium of chloro- and bromo-1,2,4-triazoles,
Tetrahedron, 1980, 36, 1071. [all data]
Cradock, Findlay, et al., 1973
Cradock, S.; Findlay, R.H.; Palmer, M.H.,
The molecular energy levels of the azoles: A study by photoelectron spectroscopy and ab initio molecular orbital calculations,
Tetrahedron, 1973, 29, 2173. [all data]
Zhuravleva, 2000
Zhuravleva, I.L.,
Evaluation of the polarity and boiling points of nitrogen-containing heterocyclic compounds by gas chromatography,
Russ. Chem. Bull. (Engl. Transl.), 2000, 49, 2, 325-328, https://doi.org/10.1007/BF02494682
. [all data]
Golovnya, Kuz'menko, et al., 1999
Golovnya, R.V.; Kuz'menko, T.E.; Zhuravleva, I.L.,
Gas chromatographic indicator of the ability of five- and six-membered heterocyclic nitrogen-containing compounds for self-association in pure liquids,
Russ. Chem. Bull. (Engl. Transl.), 1999, 48, 4, 726-729, https://doi.org/10.1007/BF02496256
. [all data]