Ethyl radical-1,1-d2
- Formula: C2H3D2
- Molecular weight: 31.0734
- IUPAC Standard InChIKey: QUPDWYMUPZLYJZ-DICFDUPASA-N
- CAS Registry Number: 28882-22-6
- Chemical structure:
View 3d structure (requires JavaScript / HTML 5) - Isotopologues:

Gas phase ion energetics data

Data compiled by: Sharon G. Lias, Rhoda D. Levin, and Sherif A. Kafafi
Ionization energy determinations
IE (eV) | Method | Reference |
---|---|---|
8.38 ± 0.02 | PE | Houle and Beauchamp, 1979 |

References

Houle and Beauchamp, 1979
Houle, F.A.; Beauchamp, J.L.,
Photoelectron spectroscopy of methyl, ethyl, isopropyl, and tert-butyl radicals. Implications for the thermochemistry and structures of the radicals and their corresponding carbonium ions,
J. Am. Chem. Soc., 1979, 101, 4067. [all data]