Pyridine,4-(trimethylstannyl)-,1-oxide
- Formula: C8H13NOSn
- Molecular weight: 257.905
- IUPAC Standard InChIKey: IOGWXHBZESXIQS-UHFFFAOYSA-N
- CAS Registry Number: 28867-09-6
- Chemical structure:
View 3d structure (requires JavaScript / HTML 5) - Permanent link for this species. Use this link for bookmarking this species for future reference.

Gas phase ion energetics data

Data compiled by: Sharon G. Lias, Rhoda D. Levin, and Sherif A. Kafafi
Ionization energy determinations
IE (eV) | Method | Reference | Comment |
---|---|---|---|
8.04 | PE | Weiner and Lattman, 1974 | Vertical value |

References

Weiner and Lattman, 1974
Weiner, M.A.; Lattman, M.,
Photoelectron spectra of 4-substituted pyridine N-oxides,
Tetrahedron Lett., 1974, 1709. [all data]