Bicyclo[7.2.0]undecane,6,10,10-trimethyl-2-methylene-5-nitro-6-nitroso-
- Formula: C15H24N2O3
- Molecular weight: 280.3627
- IUPAC Standard InChIKey: IXMGPRFXGAEAOT-UHFFFAOYSA-N
- CAS Registry Number: 28834-17-5
- Chemical structure:
View 3d structure (requires JavaScript / HTML 5) - Permanent link for this species. Use this link for bookmarking this species for future reference.

Gas phase ion energetics data

Data compiled by: Sharon G. Lias, Rhoda D. Levin, and Sherif A. Kafafi
Ionization energy determinations
IE (eV) | Method | Reference | Comment |
---|---|---|---|
9.26 | PE | Egdell, Green, et al., 1975 | Vertical value |

References

Egdell, Green, et al., 1975
Egdell, R.; Green, J.C.; Rao, C.N.R.; Gowenlock, B.G.; Pfab, J.,
He(I) photoelectron studies of C-nitroso compounds,
J. Chem. Soc. Faraday Trans. 2, 1975, 988. [all data]