Isothiazole
- Formula: C3H3NS
- Molecular weight: 85.128
- IUPAC Standard InChIKey: ZLTPDFXIESTBQG-UHFFFAOYSA-N
- CAS Registry Number: 288-16-4
- Chemical structure:
View 3d structure (requires JavaScript / HTML 5) - Permanent link for this species. Use this link for bookmarking this species for future reference.

Gas phase ion energetics data

Data compiled as indicated in comments:
LLK - Sharon G. Lias, Rhoda D. Levin, and Sherif A. Kafafi
Ionization energy determinations
IE (eV) | Method | Reference | Comment |
---|---|---|---|
9.80 | EI | Salmona, Ferre, et al., 1971 | LLK |
9.55 | PE | Salmona, Ferre, et al., 1971 | LLK |
9.62 | PE | Daamen, Oskam, et al., 1979 | Vertical value; LLK |

References

Salmona, Ferre, et al., 1971
Salmona, G.; Ferre, Y.; Vincent, E.J.,
Etudes experimentales et theoriques de potentiels d'ionisation de derives de la serie de l'isothiazole,
C.R. Acad. Sci. Ser. 3:, 1971, 273, 863. [all data]
Daamen, Oskam, et al., 1979
Daamen, H.; Oskam, A.; Stufkens, D.J.; Waaijers, H.W.,
Bonding properties of group VIB metal pentacarbonyl azole complexes studied by electronic absorption, photoelectron, 13C NMR and vibrational spectroscopy,
Inorg. Chim. Acta, 1979, 34, 253. [all data]
Johnson and Slack, 1967
Johnson, E.A.; Slack, R.,
UV atlas of organic compounds, 1967, 3, G2/4. [all data]