Isoxazole
- Formula: C3H3NO
- Molecular weight: 69.0620
- IUPAC Standard InChIKey: CTAPFRYPJLPFDF-UHFFFAOYSA-N
- CAS Registry Number: 288-14-2
- Chemical structure:
View 3d structure (requires JavaScript / HTML 5) - Other names: 1-Oxa-2-azacyclopentadiene; Isooxazole

Gas phase thermochemistry data

Data compiled by: Hussein Y. Afeefy, Joel F. Liebman, and Stephen E. Stein
Quantity | Value | Units | Method | Reference | Comment |
---|---|---|---|---|---|
ΔfH°gas | 82.0 ± 0.6 | kJ/mol | Ccr | Steele, Chirico, et al., 1996 | |
ΔfH°gas | 78.58 ± 0.54 | kJ/mol | Ccb | McCormick and Hamilton, 1978 | see McCormick, 1977 |

Condensed phase thermochemistry data

Data compiled as indicated in comments:
ALS - Hussein Y. Afeefy, Joel F. Liebman, and Stephen E. Stein
DH - Eugene S. Domalski and Elizabeth D. Hearing
Quantity | Value | Units | Method | Reference | Comment |
---|---|---|---|---|---|
ΔfH°liquid | 44.78 ± 0.56 | kJ/mol | Ccr | Steele, Chirico, et al., 1996 | ALS |
ΔfH°liquid | 42.13 ± 0.54 | kJ/mol | Ccb | McCormick and Hamilton, 1978 | see McCormick, 1977; ALS |
Quantity | Value | Units | Method | Reference | Comment |
ΔcH°liquid | -1654.05 ± 0.32 | kJ/mol | Ccr | Steele, Chirico, et al., 1996 | ALS |
ΔcH°liquid | -1651.4 ± 0.50 | kJ/mol | Ccb | McCormick and Hamilton, 1978 | see McCormick, 1977; ALS |
Constant pressure heat capacity of liquid
Cp,liquid (J/mol*K) | Temperature (K) | Reference | Comment |
---|---|---|---|
108.1 | 298.15 | Steele, Chirico, et al., 1993 | DH |

Phase change data

Data compiled as indicated in comments:
BS - Robert L. Brown and Stephen E. Stein
TRC - Thermodynamics Research Center, NIST Boulder Laboratories, Chris Muzny director
ALS - Hussein Y. Afeefy, Joel F. Liebman, and Stephen E. Stein
AC - William E. Acree, Jr., James S. Chickos
Quantity | Value | Units | Method | Reference | Comment |
---|---|---|---|---|---|
Tboil | 367.2 | K | N/A | Aldrich Chemical Company Inc., 1990 | BS |
Tboil | 368.7 | K | N/A | Weast and Grasselli, 1989 | BS |
Quantity | Value | Units | Method | Reference | Comment |
Tc | 590. | K | N/A | Steele, Chirico, et al., 1996, 2 | Uncertainty assigned by TRC = 3. K; fitting parameter in Wagner equation for vapor pressure; TRC |
Quantity | Value | Units | Method | Reference | Comment |
Pc | 61.00 | bar | N/A | Steele, Chirico, et al., 1996, 2 | Uncertainty assigned by TRC = 4.00 bar; from extrapolation of obs. vapor pressure to Tc; TRC |
Quantity | Value | Units | Method | Reference | Comment |
ρc | 5.237 | mol/l | N/A | Steele, Chirico, et al., 1996, 2 | Uncertainty assigned by TRC = 0.29 mol/l; TRC |
Quantity | Value | Units | Method | Reference | Comment |
ΔvapH° | 37.24 ± 0.22 | kJ/mol | V | Steele, Chirico, et al., 1996 | ALS |
ΔvapH° | 37.2 ± 0.2 | kJ/mol | EB | Steele, Chirico, et al., 1996 | Based on data from 314. to 404. K.; AC |
ΔvapH° | 36.4 ± 0.04 | kJ/mol | C | McCormick and Hamilton, 1978 | see McCormick, 1977; ALS |
ΔvapH° | 36.5 ± 0.1 | kJ/mol | C | McCormick and Hamilton, 1978 | AC |

Gas phase ion energetics data

Data evaluated as indicated in comments:
HL - Edward P. Hunter and Sharon G. Lias
L - Sharon G. Lias
Data compiled as indicated in comments:
LLK - Sharon G. Lias, Rhoda D. Levin, and Sherif A. Kafafi
RDSH - Henry M. Rosenstock, Keith Draxl, Bruce W. Steiner, and John T. Herron
LBLHLM - Sharon G. Lias, John E. Bartmess, Joel F. Liebman, John L. Holmes, Rhoda D. Levin, and W. Gary Mallard
Quantity | Value | Units | Method | Reference | Comment |
---|---|---|---|---|---|
IE (evaluated) | 10. ± 0.1 | eV | N/A | N/A | L |
Quantity | Value | Units | Method | Reference | Comment |
Proton affinity (review) | 848.6 | kJ/mol | N/A | Hunter and Lias, 1998 | HL |
Quantity | Value | Units | Method | Reference | Comment |
Gas basicity | 816.8 | kJ/mol | N/A | Hunter and Lias, 1998 | HL |
Ionization energy determinations
IE (eV) | Method | Reference | Comment |
---|---|---|---|
9.93 ± 0.05 | EI | Bouchoux and Hoppilliard, 1981 | LLK |
9.99 ± 0.05 | PE | Baker, Betteridge, et al., 1970 | RDSH |
10.20 | PE | Daamen, Oskam, et al., 1979 | Vertical value; LLK |
Appearance energy determinations
Ion | AE (eV) | Other Products | Method | Reference | Comment |
---|---|---|---|---|---|
HCO+ | 13.62 | ? | EI | Bouchoux and Hoppilliard, 1981 | LLK |
CNO+ | 12.24 | C2H3 | EI | Bouchoux and Hoppilliard, 1981 | LLK |
C2H2N+ | 13.34 | HCO | EI | Bouchoux and Hoppilliard, 1981 | LLK |
C2H3N+ | 11.34 ± 0.05 | CO | EI | Buschek, Holmes, et al., 1986 | LBLHLM |
C2H3N+ | 11.80 | CO | EI | Bouchoux and Hoppilliard, 1981 | LLK |
C3H2NO+ | 11.24 | H | EI | Bouchoux and Hoppilliard, 1981 | LLK |

Kovats' RI, non-polar column, isothermal

Column type | Active phase | Temperature (C) | I | Reference | Comment |
---|---|---|---|---|---|
Capillary | OV-101 | 110. | 590. | Zhuravleva, 2000 | 50. m/0.3 mm/0.4 μm, He |
Capillary | OV-101 | 110. | 590. | Golovnya, Kuz'menko, et al., 1999 | 50. m/0.3 mm/0.4 μm, He |

References

Steele, Chirico, et al., 1996
Steele, W.V.; Chirico, R.D.; Knipmeyer, S.E.; Nguyen, A.; Smith, N.K.; Tasker, I.R.,
Thermodynamic properties and ideal-gas enthalpies of formation for cyclohexene, phthalan (2,5-dihydrobenzo-3,4-furan), isoxazole, octylamine, dioctylamine, trioctylamine, phenyl isocyanate, and 1,4,5,6-tetrahydropyrimidine,
J. Chem. Eng. Data, 1996, 41, 1269-1284. [all data]
McCormick and Hamilton, 1978
McCormick, D.G.; Hamilton, W.S.,
The enthalpies of combustion and formation of oxazole and isoxazole,
J. Chem. Thermodyn., 1978, 10, 275-278. [all data]
McCormick, 1977
McCormick, D.G.,
The resonance energies of oxazole and isoxazole determined from the enthalpies of combustion and formation (Order No. 7801771),
Diss. Abstr. Int. B, 1977, 38, 4271. [all data]
Steele, Chirico, et al., 1993
Steele, W.V.; Chirico, R.D.; Knipmeyer, S.E.; Nguyen, A.; Tasker, I.R.,
Determination of ideal gas enthalpies of formation for key compounds the 1991 project results,
DIPPR Project, 1993, 871, NIPER-716. [all data]
Aldrich Chemical Company Inc., 1990
Aldrich Chemical Company Inc.,
Catalog Handbook of Fine Chemicals, Aldrich Chemical Company, Inc., Milwaukee WI, 1990, 1. [all data]
Weast and Grasselli, 1989
CRC Handbook of Data on Organic Compounds, 2nd Editon, Weast,R.C and Grasselli, J.G., ed(s)., CRC Press, Inc., Boca Raton, FL, 1989, 1. [all data]
Steele, Chirico, et al., 1996, 2
Steele, W.V.; Chirico, R.D.; Knipmeyer, S.E.; Nguyen, A.; Smith, N.K.; Tasker, I.R.,
Thermodynamic Properties and Ideal-Gas Enthalpies of Formation for Dioctylamine, trioctylamine, Phenyl Isocyanate, and 1,4,5,6-Tetrahydropyrimidine,
J. Chem. Eng. Data, 1996, 41, 1269-84. [all data]
Hunter and Lias, 1998
Hunter, E.P.; Lias, S.G.,
Evaluated Gas Phase Basicities and Proton Affinities of Molecules: An Update,
J. Phys. Chem. Ref. Data, 1998, 27, 3, 413-656, https://doi.org/10.1063/1.556018
. [all data]
Bouchoux and Hoppilliard, 1981
Bouchoux, G.; Hoppilliard, Y.,
Fragmentation mechanisms of isoxazole,
Org. Mass Spectrom., 1981, 16, 459. [all data]
Baker, Betteridge, et al., 1970
Baker, A.D.; Betteridge, D.; Kemp, N.R.; Kirby, R.E.,
Application of photoelectron spectrometry to pesticide analysis. Photoelectron spectra of fivemembered heterocycles and related molecules,
Anal. Chem., 1970, 42, 1064. [all data]
Daamen, Oskam, et al., 1979
Daamen, H.; Oskam, A.; Stufkens, D.J.; Waaijers, H.W.,
Bonding properties of group VIB metal pentacarbonyl azole complexes studied by electronic absorption, photoelectron, 13C NMR and vibrational spectroscopy,
Inorg. Chim. Acta, 1979, 34, 253. [all data]
Buschek, Holmes, et al., 1986
Buschek, J.M.; Holmes, J.L.; Lossing, F.P.,
The mass spectrometric generation of neutral ethynamine HC≡CNH2 and C2H3N isomers.,
Org. Mass Spectrom., 1986, 21, 729. [all data]
Johnson and Sheridan, 1967
Johnson, E.A.; Sheridan, J.,
UV atlas of organic compounds, 1967, 3, G3/2. [all data]
Zhuravleva, 2000
Zhuravleva, I.L.,
Evaluation of the polarity and boiling points of nitrogen-containing heterocyclic compounds by gas chromatography,
Russ. Chem. Bull. (Engl. Transl.), 2000, 49, 2, 325-328, https://doi.org/10.1007/BF02494682
. [all data]
Golovnya, Kuz'menko, et al., 1999
Golovnya, R.V.; Kuz'menko, T.E.; Zhuravleva, I.L.,
Gas chromatographic indicator of the ability of five- and six-membered heterocyclic nitrogen-containing compounds for self-association in pure liquids,
Russ. Chem. Bull. (Engl. Transl.), 1999, 48, 4, 726-729, https://doi.org/10.1007/BF02496256
. [all data]