1H-Pyrazole
- Formula: C3H4N2
- Molecular weight: 68.0773
- IUPAC Standard InChIKey: WTKZEGDFNFYCGP-UHFFFAOYSA-N
- CAS Registry Number: 288-13-1
- Chemical structure:
View 3d structure (requires JavaScript / HTML 5) - Other names: Pyrazole; 1,2-Diazole

Gas phase thermochemistry data

Data compiled as indicated in comments:
DRB - Donald R. Burgess, Jr.
ALS - Hussein Y. Afeefy, Joel F. Liebman, and Stephen E. Stein
Quantity | Value | Units | Method | Reference | Comment |
---|---|---|---|---|---|
ΔfH°gas | 177.4 | kJ/mol | N/A | Zaheeruddin and Lodhi, 1991 | Value computed using ΔfHsolid° value of 112.4 kj/mol from Zaheeruddin and Lodhi, 1991 and ΔsubH° value of 65.0 kj/mol from Jimenez, Roux, et al., 1987.; DRB |
ΔfH°gas | 179.4 ± 0.8 | kJ/mol | Ccb | Jimenez, Roux, et al., 1987 | see Jimenez, Roux, et al., 1986; ALS |
ΔfH°gas | 181. ± 8.8 | kJ/mol | Ccb | Bedford, Edmondson, et al., 1962 | ALS |

Condensed phase thermochemistry data

Data compiled as indicated in comments:
ALS - Hussein Y. Afeefy, Joel F. Liebman, and Stephen E. Stein
DH - Eugene S. Domalski and Elizabeth D. Hearing
Quantity | Value | Units | Method | Reference | Comment |
---|---|---|---|---|---|
ΔfH°solid | Ccb | Zaheeruddin and Lodhi, 1991 | uncertain value: 112.38 kJ/mol; ALS | ||
ΔfH°solid | 105.4 ± 0.7 | kJ/mol | Ccb | Jimenez, Roux, et al., 1987 | see Jimenez, Roux, et al., 1986; ALS |
ΔfH°solid | 116.0 ± 4.6 | kJ/mol | Ccb | Bedford, Edmondson, et al., 1962 | Reanalyzed by Cox and Pilcher, 1970, Original value = 118. ± 4.6 kJ/mol; ALS |
Quantity | Value | Units | Method | Reference | Comment |
ΔcH°solid | Ccb | Zaheeruddin and Lodhi, 1991 | uncertain value: -1864.60 kJ/mol; ALS | ||
ΔcH°solid | -1857.6 ± 0.6 | kJ/mol | Ccb | Jimenez, Roux, et al., 1987 | see Jimenez, Roux, et al., 1986; ALS |
ΔcH°solid | -1868.2 ± 4.6 | kJ/mol | Ccb | Bedford, Edmondson, et al., 1962 | Reanalyzed by Cox and Pilcher, 1970, Original value = -1870.8 ± 4.6 kJ/mol; ALS |
ΔcH°solid | -1859. | kJ/mol | Ccb | Zimmerman and Geisenfelder, 1961 | ALS |
Constant pressure heat capacity of solid
Cp,solid (J/mol*K) | Temperature (K) | Reference | Comment |
---|---|---|---|
81.0 | 298.15 | Jimenez, Roux, et al., 1987 | Cp given as 1.19 J/g*K.; DH |
87.9 | 300. | DeWit, Offringa, et al., 1983 | T = 300 to 450 K.; DH |

Phase change data

Data compiled as indicated in comments:
BS - Robert L. Brown and Stephen E. Stein
TRC - Thermodynamics Research Center, NIST Boulder Laboratories, Chris Muzny director
ALS - Hussein Y. Afeefy, Joel F. Liebman, and Stephen E. Stein
DRB - Donald R. Burgess, Jr.
AC - William E. Acree, Jr., James S. Chickos
DH - Eugene S. Domalski and Elizabeth D. Hearing
Quantity | Value | Units | Method | Reference | Comment |
---|---|---|---|---|---|
Tboil | 460.2 | K | N/A | Weast and Grasselli, 1989 | BS |
Tboil | 460.15 | K | N/A | Lecat, 1947 | Uncertainty assigned by TRC = 1.5 K; TRC |
Quantity | Value | Units | Method | Reference | Comment |
Tfus | 343.2 | K | N/A | Hilgeman, Mouroux, et al., 1989 | Uncertainty assigned by TRC = 0.4 K; TRC |
Tfus | 333.1 | K | N/A | De Wit, Offringa, et al., 1983 | Uncertainty assigned by TRC = 0.2 K; TRC |
Quantity | Value | Units | Method | Reference | Comment |
ΔsubH° | 70. ± 8. | kJ/mol | AVG | N/A | Average of 7 values; Individual data points |
Enthalpy of sublimation
ΔsubH (kJ/mol) | Temperature (K) | Method | Reference | Comment |
---|---|---|---|---|
74.3 ± 0.4 | 275. | ME | Jimenez, Roux, et al., 1987 | Based on data from 268. to 287. K.; AC |
72.7 | 265. | TE,ME | De Wit, Van Miltenburg, et al., 1983 | Based on data from 253. to 273. K.; AC |
Enthalpy of fusion
ΔfusH (kJ/mol) | Temperature (K) | Reference | Comment |
---|---|---|---|
14.200 | 343.2 | Hilgeman, Mouroux, et al., 1989, 2 | DH |
13.800 | 333.1 | DeWit, Offringa, et al., 1983 | DH |
14.2 | 343.2 | Domalski and Hearing, 1996 | AC |
Entropy of fusion
ΔfusS (J/mol*K) | Temperature (K) | Reference | Comment |
---|---|---|---|
41.43 | 333.1 | DeWit, Offringa, et al., 1983 | DH |

Reaction thermochemistry data

Data compiled as indicated in comments:
B - John E. Bartmess
RCD - Robert C. Dunbar
Individual Reactions
C3H3N2- + =
By formula: C3H3N2- + H+ = C3H4N2
Quantity | Value | Units | Method | Reference | Comment |
---|---|---|---|---|---|
ΔrH° | 1479. ± 10. | kJ/mol | G+TS | Gianola, Ichino, et al., 2006 | gas phase; B |
ΔrH° | 1479. ± 10. | kJ/mol | G+TS | Taft, Anvia, et al., 1986 | gas phase; value altered from reference due to change in acidity scale; B |
Quantity | Value | Units | Method | Reference | Comment |
ΔrG° | 1449. ± 9.6 | kJ/mol | N/A | Gianola, Ichino, et al., 2006 | gas phase; B |
ΔrG° | 1449. ± 9.6 | kJ/mol | IMRE | Taft, Anvia, et al., 1986 | gas phase; value altered from reference due to change in acidity scale; B |
By formula: Li+ + C3H4N2 = (Li+ • C3H4N2)
Quantity | Value | Units | Method | Reference | Comment |
---|---|---|---|---|---|
ΔrH° | 187. ± 17. | kJ/mol | CIDT | Huang and Rodgers, 2002 | RCD |
By formula: Na+ + C3H4N2 = (Na+ • C3H4N2)
Quantity | Value | Units | Method | Reference | Comment |
---|---|---|---|---|---|
ΔrH° | 128. ± 9.2 | kJ/mol | CIDT | Huang and Rodgers, 2002 | RCD |
By formula: K+ + C3H4N2 = (K+ • C3H4N2)
Quantity | Value | Units | Method | Reference | Comment |
---|---|---|---|---|---|
ΔrH° | 84. ± 3. | kJ/mol | CIDT | Huang and Rodgers, 2002 | RCD |

Gas phase ion energetics data

Data evaluated as indicated in comments:
HL - Edward P. Hunter and Sharon G. Lias
Data compiled as indicated in comments:
B - John E. Bartmess
LL - Sharon G. Lias and Joel F. Liebman
LBLHLM - Sharon G. Lias, John E. Bartmess, Joel F. Liebman, John L. Holmes, Rhoda D. Levin, and W. Gary Mallard
LLK - Sharon G. Lias, Rhoda D. Levin, and Sherif A. Kafafi
RDSH - Henry M. Rosenstock, Keith Draxl, Bruce W. Steiner, and John T. Herron
Quantity | Value | Units | Method | Reference | Comment |
---|---|---|---|---|---|
Proton affinity (review) | 894.1 | kJ/mol | N/A | Hunter and Lias, 1998 | HL |
Quantity | Value | Units | Method | Reference | Comment |
Gas basicity | 860.5 | kJ/mol | N/A | Hunter and Lias, 1998 | HL |
Ionization energy determinations
IE (eV) | Method | Reference | Comment |
---|---|---|---|
9.38 ± 0.03 | PE | Lichtenberger, Copenhaver, et al., 1988 | LL |
9.25 ± 0.01 | PI | Main-Bobo, Loesik, et al., 1986 | LBLHLM |
9.27 ± 0.05 | PE | Baker, Betteridge, et al., 1970 | RDSH |
9.15 | PE | Daamen, Oskam, et al., 1979 | Vertical value; LLK |
9.15 | PE | Cradock, Findlay, et al., 1973 | Vertical value; LLK |
Appearance energy determinations
Ion | AE (eV) | Other Products | Method | Reference | Comment |
---|---|---|---|---|---|
CH2N+ | 11.72 ± 0.05 | C2H2N | PI | Main-Bobo, Loesik, et al., 1986 | LBLHLM |
C2H3N+ | 11.76 ± 0.02 | CHN | PI | Main-Bobo, Loesik, et al., 1986 | LBLHLM |
De-protonation reactions
C3H3N2- + =
By formula: C3H3N2- + H+ = C3H4N2
Quantity | Value | Units | Method | Reference | Comment |
---|---|---|---|---|---|
ΔrH° | 1479. ± 10. | kJ/mol | G+TS | Gianola, Ichino, et al., 2006 | gas phase; B |
ΔrH° | 1479. ± 10. | kJ/mol | G+TS | Taft, Anvia, et al., 1986 | gas phase; value altered from reference due to change in acidity scale; B |
Quantity | Value | Units | Method | Reference | Comment |
ΔrG° | 1449. ± 9.6 | kJ/mol | N/A | Gianola, Ichino, et al., 2006 | gas phase; B |
ΔrG° | 1449. ± 9.6 | kJ/mol | IMRE | Taft, Anvia, et al., 1986 | gas phase; value altered from reference due to change in acidity scale; B |

Ion clustering data

Data compiled by: Robert C. Dunbar
Clustering reactions
By formula: K+ + C3H4N2 = (K+ • C3H4N2)
Quantity | Value | Units | Method | Reference | Comment |
---|---|---|---|---|---|
ΔrH° | 84. ± 3. | kJ/mol | CIDT | Huang and Rodgers, 2002 |
By formula: Li+ + C3H4N2 = (Li+ • C3H4N2)
Quantity | Value | Units | Method | Reference | Comment |
---|---|---|---|---|---|
ΔrH° | 187. ± 17. | kJ/mol | CIDT | Huang and Rodgers, 2002 |
By formula: Na+ + C3H4N2 = (Na+ • C3H4N2)
Quantity | Value | Units | Method | Reference | Comment |
---|---|---|---|---|---|
ΔrH° | 128. ± 9.2 | kJ/mol | CIDT | Huang and Rodgers, 2002 |

Kovats' RI, non-polar column, isothermal

Column type | Active phase | Temperature (C) | I | Reference | Comment |
---|---|---|---|---|---|
Capillary | OV-101 | 110. | 864. | Zhuravleva, 2000 | 50. m/0.3 mm/0.4 μm, He |
Capillary | OV-101 | 110. | 864. | Golovnya, Kuz'menko, et al., 1999 | 50. m/0.3 mm/0.4 μm, He |

Van Den Dool and Kratz RI, non-polar column, temperature ramp

Column type | Active phase | I | Reference | Comment |
---|---|---|---|---|
Packed | SE-30 | 837. | Peng, Ding, et al., 1988 | He, Supelcoport and Chromosorb, 40. C @ 4. min, 10. K/min, 250. C @ 60. min; Column length: 3.05 m |

References

Zaheeruddin and Lodhi, 1991
Zaheeruddin, M.; Lodhi, Z.H.,
Enthalpies of formation of some cyclic compounds,
Phys. Chem. (Peshawar Pak.), 1991, 10, 111-118. [all data]
Jimenez, Roux, et al., 1987
Jimenez, P.; Roux, M.V.; Turrion, C.,
Thermochemical properties of N-heterocyclic compounds. I. Enthalpies of combustion, vapour pressures and enthalpies of sublimation, and enthalpies of formation of pyrazole, imidazole, indazole, and benzimidazole,
J. Chem. Thermodyn., 1987, 19, 985-992. [all data]
Jimenez, Roux, et al., 1986
Jimenez, P.; Roux, M.V.; Turrion, C.; Gomis, F.,
Thermochemical properties of some N-heterocyclic compounds,
J. Calorim. Anal. Therm. Thermodyn. Chim., 1986, 17, 469-470. [all data]
Bedford, Edmondson, et al., 1962
Bedford, A.F.; Edmondson, P.B.; Mortimer, C.T.,
Heats of formation and bond energies. Part VI. n-Butyliso-butyraldimine, n-butylisobutylamine, pyrazole, and imidazole,
J. Chem. Soc., 1962, 2927-2931. [all data]
Cox and Pilcher, 1970
Cox, J.D.; Pilcher, G.,
Thermochemistry of Organic and Organometallic Compounds, Academic Press, New York, 1970, 1-636. [all data]
Zimmerman and Geisenfelder, 1961
Zimmerman, H.; Geisenfelder, H.,
Uber die Mesomerieenergie von Azolen,
Z. Electrochem., 1961, 65, 368-371. [all data]
DeWit, Offringa, et al., 1983
DeWit, H.G.M.; Offringa, J.C.A.; De Kruif, C.G.; Van Miltenburg, J.C.,
Thermodynamic properties of molecular organic crystals containing nitrogen, oxygen and sulfur. III. Molar heat capacities measured by differential scanning calorimetry,
Thermochim. Acta, 1983, 65, 43-51. [all data]
Weast and Grasselli, 1989
CRC Handbook of Data on Organic Compounds, 2nd Editon, Weast,R.C and Grasselli, J.G., ed(s)., CRC Press, Inc., Boca Raton, FL, 1989, 1. [all data]
Lecat, 1947
Lecat, M.,
Some azeotropes of which one constituant is heterocyclic nitrogen,
Ann. Soc. Sci. Bruxelles, Ser. 1, 1947, 61, 73. [all data]
Hilgeman, Mouroux, et al., 1989
Hilgeman, F.R.; Mouroux, F.Y.N.; Mok, D.; Holan, M.K.,
Phase Diagrams of Binary Solid Azole Systems,
J. Chem. Eng. Data, 1989, 34, 220. [all data]
De Wit, Offringa, et al., 1983
De Wit, H.G.M.; Offringa, J.C.A.; De Kruif, C.G.; van Miltenburg, J.C.,
Thremodynamic properties of molecular organic crystals containing nitrogen, oxygen and sulfur. III. molar heat capacities measured by DSC. scanning calorimetry.,
Thermochim. Acta, 1983, 65, 43. [all data]
De Wit, Van Miltenburg, et al., 1983
De Wit, H.G.M.; Van Miltenburg, J.C.; De Kruif, C.G.,
Thermodynamic properties of molecular organic crystals containing nitrogen, oxygen, and sulphur 1. Vapour pressures and enthalpies of sublimation,
The Journal of Chemical Thermodynamics, 1983, 15, 7, 651-663, https://doi.org/10.1016/0021-9614(83)90079-4
. [all data]
Hilgeman, Mouroux, et al., 1989, 2
Hilgeman, F.R.; Mouroux, F.Y.N.; Mok, D.; Holan, M.K.,
Phase diagrams of binary solid azole systems,
J. Chem. Eng. Data, 1989, 34, 220-222. [all data]
Domalski and Hearing, 1996
Domalski, Eugene S.; Hearing, Elizabeth D.,
Heat Capacities and Entropies of Organic Compounds in the Condensed Phase. Volume III,
J. Phys. Chem. Ref. Data, 1996, 25, 1, 1, https://doi.org/10.1063/1.555985
. [all data]
Gianola, Ichino, et al., 2006
Gianola, A.J.; Ichino, T.; Kato, S.; Bierbaum, V.M.; Lineberger, W.C.,
Thermochemical studies of pyrazolide,
J. Phys. Chem. A, 2006, 110, 27, 8457-8466, https://doi.org/10.1021/jp057499+
. [all data]
Taft, Anvia, et al., 1986
Taft, R.W.; Anvia, F.; Taagepera, M.; Catalan, J.; Elgueroy, J.,
Electrostatic proximity effects in the relative basicities of pyrazole, imidazole, pyridazine, and pyrimidine,
J. Am. Chem. Soc., 1986, 108, 3237. [all data]
Huang and Rodgers, 2002
Huang, H.; Rodgers, M.T.,
Sigma versus Pi interactions in alkali metal ion binding to azoles: Threshold collision-induced dissociation and ab initio theory studies,
J. Phys. Chem. A, 2002, 106, 16, 4277, https://doi.org/10.1021/jp013630b
. [all data]
Hunter and Lias, 1998
Hunter, E.P.; Lias, S.G.,
Evaluated Gas Phase Basicities and Proton Affinities of Molecules: An Update,
J. Phys. Chem. Ref. Data, 1998, 27, 3, 413-656, https://doi.org/10.1063/1.556018
. [all data]
Lichtenberger, Copenhaver, et al., 1988
Lichtenberger, D.L.; Copenhaver, A.S.; Gray, H.B.; Marshall, J.L.; Hopkins, M.D.,
Valence electronic structure of bis(Pyrazolyl)-bridged iridium dicarbonyl dimers. Electronic effects of 3,5-dimethylpyraxzolyl substitution on metal-metal interactions,
Inorg. Chem., 1988, 27, 4488. [all data]
Main-Bobo, Loesik, et al., 1986
Main-Bobo, J.; Loesik, S.; Gase, W.; Baer, T.; Mommers, A.; Holmes, J.,
The thermochemistry and dissociation dynamics of internal-energy selected pyrazole and imidazole ions,
J. Am. Chem. Soc., 1986, 108, 677. [all data]
Baker, Betteridge, et al., 1970
Baker, A.D.; Betteridge, D.; Kemp, N.R.; Kirby, R.E.,
Application of photoelectron spectrometry to pesticide analysis. Photoelectron spectra of fivemembered heterocycles and related molecules,
Anal. Chem., 1970, 42, 1064. [all data]
Daamen, Oskam, et al., 1979
Daamen, H.; Oskam, A.; Stufkens, D.J.; Waaijers, H.W.,
Bonding properties of group VIB metal pentacarbonyl azole complexes studied by electronic absorption, photoelectron, 13C NMR and vibrational spectroscopy,
Inorg. Chim. Acta, 1979, 34, 253. [all data]
Cradock, Findlay, et al., 1973
Cradock, S.; Findlay, R.H.; Palmer, M.H.,
The molecular energy levels of the azoles: A study by photoelectron spectroscopy and ab initio molecular orbital calculations,
Tetrahedron, 1973, 29, 2173. [all data]
Knowles and Elguero, 1967
Knowles, A.; Elguero, J.,
UV atlas of organic compounds, 1967, 3, G1/6. [all data]
Zhuravleva, 2000
Zhuravleva, I.L.,
Evaluation of the polarity and boiling points of nitrogen-containing heterocyclic compounds by gas chromatography,
Russ. Chem. Bull. (Engl. Transl.), 2000, 49, 2, 325-328, https://doi.org/10.1007/BF02494682
. [all data]
Golovnya, Kuz'menko, et al., 1999
Golovnya, R.V.; Kuz'menko, T.E.; Zhuravleva, I.L.,
Gas chromatographic indicator of the ability of five- and six-membered heterocyclic nitrogen-containing compounds for self-association in pure liquids,
Russ. Chem. Bull. (Engl. Transl.), 1999, 48, 4, 726-729, https://doi.org/10.1007/BF02496256
. [all data]
Peng, Ding, et al., 1988
Peng, C.T.; Ding, S.F.; Hua, R.L.; Yang, Z.C.,
Prediction of Retention Indexes I. Structure-Retention Index Relationship on Apolar Columns,
J. Chromatogr., 1988, 436, 137-172, https://doi.org/10.1016/S0021-9673(00)94575-8
. [all data]