Tellurophene
- Formula: C4H4Te
- Molecular weight: 179.67
- IUPAC Standard InChIKey: TULWUZJYDBGXMY-UHFFFAOYSA-N
- CAS Registry Number: 288-08-4
- Chemical structure:
View 3d structure (requires JavaScript / HTML 5) - Permanent link for this species. Use this link for bookmarking this species for future reference.

Gas phase ion energetics data

Data compiled by: Sharon G. Lias, Rhoda D. Levin, and Sherif A. Kafafi
Ionization energy determinations
IE (eV) | Method | Reference | Comment |
---|---|---|---|
8.32 | CTS | Aloisi, Santini, et al., 1975 | |
8.27 | PE | Schafer, Schweig, et al., 1973 | |
8.6 ± 0.1 | EI | Distefano, Pignataro, et al., 1973 | |
8.40 ± 0.03 | PE | Distefano, Pignataro, et al., 1973 | |
8.40 ± 0.05 | PE | Fringuelli, Marino, et al., 1976 | Vertical value |

References

Aloisi, Santini, et al., 1975
Aloisi, G.; Santini, S.; Savelli, G.,
Molecular complexes of heteroaromatic five membered ring compounds with tetracyanoethylene. Charge transfer spectra, equilibrium constants and ionization potentials of the donors,
J. Chem. Soc. Faraday Trans. 1, 1975, 70, 2045. [all data]
Schafer, Schweig, et al., 1973
Schafer, W.; Schweig, A.; Gronowitz, S.; Taticchi, A.; Fringuelli, F.,
Reversal in the sequence of two highest occupied molecular orbitals in the series thiophen, selenophen, and tellurophen,
J. Chem. Soc. Chem. Commun., 1973, 541. [all data]
Distefano, Pignataro, et al., 1973
Distefano, G.; Pignataro, S.; Innorta, G.; Fringuelli, F.; Marino, G.; Taticchi, A.,
Ionization energies of selenophen, tellurophen and some of their derivatives,
Chem. Phys. Lett., 1973, 22, 132. [all data]
Fringuelli, Marino, et al., 1976
Fringuelli, F.; Marino, G.; Taticchi, A.; Distefano, G.; Colonna, F.P.; Pignataro, S.,
Photoelectron spectra of the α-substituted derivatives of furan, thiophen, selenophen, and tellurophen. A comparative study of the molecular orbital energies,
J. Chem. Soc. Perkin Trans. 2, 1976, 276. [all data]