Cyclopropanecarboxylic acid, methyl ester
- Formula: C5H8O2
- Molecular weight: 100.1158
- IUPAC Standard InChIKey: PKAHQJNJPDVTDP-UHFFFAOYSA-N
- CAS Registry Number: 2868-37-3
- Chemical structure:
View 3d structure (requires JavaScript / HTML 5) - Other names: Methyl cyclopropanecarboxylate; Methyl cyclopropylcarboxylate

Gas phase thermochemistry data

Data compiled by: Donald R. Burgess, Jr.
Quantity | Value | Units | Method | Reference | Comment |
---|---|---|---|---|---|
ΔfH°gas | -304.7 ± 1.5 | kJ/mol | N/A | Gutner, Ryadnenko, et al., 1984 | Value computed using ΔfHliquid° value of -346±1.5 kj/mol from Gutner, Ryadnenko, et al., 1984 and ΔvapH° value of 41.27±0.06 kj/mol from missing citation. |

Condensed phase thermochemistry data

Data compiled by: Hussein Y. Afeefy, Joel F. Liebman, and Stephen E. Stein
Quantity | Value | Units | Method | Reference | Comment |
---|---|---|---|---|---|
ΔfH°liquid | -346.0 ± 1.5 | kJ/mol | Ccb | Gutner, Ryadnenko, et al., 1984 | |
Quantity | Value | Units | Method | Reference | Comment |
ΔcH°liquid | -2764.9 ± 1.5 | kJ/mol | Ccb | Gutner, Ryadnenko, et al., 1984 | Corresponding ΔfHºliquid = -346.0 kJ/mol (simple calculation by NIST; no Washburn corrections) |

Phase change data

Data compiled as indicated in comments:
BS - Robert L. Brown and Stephen E. Stein
ALS - Hussein Y. Afeefy, Joel F. Liebman, and Stephen E. Stein
AC - William E. Acree, Jr., James S. Chickos
Quantity | Value | Units | Method | Reference | Comment |
---|---|---|---|---|---|
Tboil | 388. | K | N/A | Majer and Svoboda, 1985 | |
Quantity | Value | Units | Method | Reference | Comment |
ΔvapH° | 41.3 | kJ/mol | N/A | Majer and Svoboda, 1985 | |
ΔvapH° | 41.27 ± 0.06 | kJ/mol | C | Fuchs and Hallman, 1983 | ALS |
ΔvapH° | 41.3 ± 0.1 | kJ/mol | C | Fuchs and Hallman, 1983 | AC |
Reduced pressure boiling point
Tboil (K) | Pressure (bar) | Reference | Comment |
---|---|---|---|
392.2 | 1.02 | Aldrich Chemical Company Inc., 1990 | BS |
Enthalpy of vaporization
ΔvapH (kJ/mol) | Temperature (K) | Method | Reference | Comment |
---|---|---|---|---|
35.25 | 388. | N/A | Majer and Svoboda, 1985 | |
42.6 ± 0.4 | 273. to 313. | GS | Verevkin, Kümmerlin, et al., 1998 | AC |

Reaction thermochemistry data

Data compiled by: John E. Bartmess
Individual Reactions
C5H7O2- + =
By formula: C5H7O2- + H+ = C5H8O2
Quantity | Value | Units | Method | Reference | Comment |
---|---|---|---|---|---|
ΔrH° | 1568. ± 18. | kJ/mol | G+TS | Sachs and Kass, 1994 | gas phase; Between tBuOH and HF |
Quantity | Value | Units | Method | Reference | Comment |
ΔrG° | 1535. ± 17. | kJ/mol | IMRB | Sachs and Kass, 1994 | gas phase; Between tBuOH and HF |

Gas phase ion energetics data

Data evaluated as indicated in comments:
HL - Edward P. Hunter and Sharon G. Lias
Data compiled as indicated in comments:
B - John E. Bartmess
LBLHLM - Sharon G. Lias, John E. Bartmess, Joel F. Liebman, John L. Holmes, Rhoda D. Levin, and W. Gary Mallard
Quantity | Value | Units | Method | Reference | Comment |
---|---|---|---|---|---|
Proton affinity (review) | 842.1 | kJ/mol | N/A | Hunter and Lias, 1998 | HL |
Quantity | Value | Units | Method | Reference | Comment |
Gas basicity | 811.2 | kJ/mol | N/A | Hunter and Lias, 1998 | HL |
Appearance energy determinations
Ion | AE (eV) | Other Products | Method | Reference | Comment |
---|---|---|---|---|---|
C2H3O2+ | 10.56 ± 0.05 | c-C3H5 | EI | Blanchette, Holmes, et al., 1986 | LBLHLM |
De-protonation reactions
C5H7O2- + =
By formula: C5H7O2- + H+ = C5H8O2
Quantity | Value | Units | Method | Reference | Comment |
---|---|---|---|---|---|
ΔrH° | 1568. ± 18. | kJ/mol | G+TS | Sachs and Kass, 1994 | gas phase; Between tBuOH and HF; B |
Quantity | Value | Units | Method | Reference | Comment |
ΔrG° | 1535. ± 17. | kJ/mol | IMRB | Sachs and Kass, 1994 | gas phase; Between tBuOH and HF; B |

References

Gutner, Ryadnenko, et al., 1984
Gutner, N.M.; Ryadnenko, V.L.; Karpenko, N.A.; Makhinya, E.F.; Kiseleva, N.N.,
Standard enthalpies of formation of some cyclic derivatives,
Probl. Kalorim. Khim. Termodin., Dokl. Vses. Konf., 10th, 1984, 1, 196-198. [all data]
Majer and Svoboda, 1985
Majer, V.; Svoboda, V.,
Enthalpies of Vaporization of Organic Compounds: A Critical Review and Data Compilation, Blackwell Scientific Publications, Oxford, 1985, 300. [all data]
Fuchs and Hallman, 1983
Fuchs, R.; Hallman, J.H.,
Heats of vaporization of some monosubstituted cyclopropane, cyclobutane, and cyclopentane derivatives. Some observations on the enthalpies of isodesmic ring opening reactions of cyclobutane derivatives,
Can. J. Chem., 1983, 61, 503-505. [all data]
Aldrich Chemical Company Inc., 1990
Aldrich Chemical Company Inc.,
Catalog Handbook of Fine Chemicals, Aldrich Chemical Company, Inc., Milwaukee WI, 1990, 1. [all data]
Verevkin, Kümmerlin, et al., 1998
Verevkin, S.P.; Kümmerlin, M.; Beckhaus, H.-D.; Galli, C.; Rüchardt, C.,
Geminal substituent effects, 16 - Do alkoxycarbonyl substituents stabilize small cycloalkane rings?,
Eur. J. Org. Chem., 1998, 4, 579. [all data]
Sachs and Kass, 1994
Sachs, R.K.; Kass, S.R.,
3-Carbomethoxycyclopropen-3-yl Anion - Formation and Characterization of an Antiaromatic Ion,
J. Am. Chem. Soc., 1994, 116, 2, 783, https://doi.org/10.1021/ja00081a055
. [all data]
Hunter and Lias, 1998
Hunter, E.P.; Lias, S.G.,
Evaluated Gas Phase Basicities and Proton Affinities of Molecules: An Update,
J. Phys. Chem. Ref. Data, 1998, 27, 3, 413-656, https://doi.org/10.1063/1.556018
. [all data]
Blanchette, Holmes, et al., 1986
Blanchette, M.C.; Holmes, J.L.; Hop, C.E.C.A.; Lossing, F.P.; Postma, R.; Ruttink, P.J.A.; Terlouw, J.K.,
Theory and experiment in concert; the CH3O-C=O+ ion and its isomers,
J. Am. Chem. Soc., 1986, 108, 7589. [all data]