Bicyclo[6.1.0]nonane
- Formula: C9H16
- Molecular weight: 124.2233
- IUPAC Standard InChIKey: FYECUAIUGWFPJF-UHFFFAOYSA-N
- CAS Registry Number: 286-60-2
- Chemical structure:
View 3d structure (requires JavaScript / HTML 5) - Stereoisomers:

Gas phase ion energetics data

Data compiled as indicated in comments:
LLK - Sharon G. Lias, Rhoda D. Levin, and Sherif A. Kafafi
Ionization energy determinations
IE (eV) | Method | Reference | Comment |
---|---|---|---|
9.4 | PE | Bischof, Heilbronner, et al., 1971 | Vertical value; LLK |

Kovats' RI, non-polar column, isothermal

Column type | Active phase | Temperature (C) | I | Reference | Comment |
---|---|---|---|---|---|
Capillary | Squalane | 100. | 1003. | Schomburg, 1966 |

References

Bischof, Heilbronner, et al., 1971
Bischof, P.; Heilbronner, E.; Prinzbach, H.; Martin, H.D.,
A photoelectron-spectroscopic investigation of the homoconjugative interaction between π- and Walsh-orbitals in endo- and exo- cyclopropano-norbornene,
Helv. Chim. Acta, 1971, 54, 1072. [all data]
Schomburg, 1966
Schomburg, G.,
Gaschromatographische Retentionsdaten und struktur chemischer verbindungen. III. Alkylverzweigte und ungesättigte cyclische Kohlenwasserstoffe,
J. Chromatogr., 1966, 23, 18-41, https://doi.org/10.1016/S0021-9673(01)98653-4
. [all data]