Tricyclo[4.2.0.02,5]octane, syn-
- Formula: C8H12
- Molecular weight: 108.1809
- IUPAC Standard InChIKey: YTZCZYFFHKYOBJ-KVFPUHGPSA-N
- CAS Registry Number: 28636-10-4
- Chemical structure:
View 3d structure (requires JavaScript / HTML 5) - Stereoisomers:

Gas phase thermochemistry data

Data compiled by: Hussein Y. Afeefy, Joel F. Liebman, and Stephen E. Stein
Quantity | Value | Units | Method | Reference | Comment |
---|---|---|---|---|---|
ΔfH°gas | 235. ± 4.2 | kJ/mol | Ccb | Walsh, Martin, et al., 1981 |

Condensed phase thermochemistry data

Data compiled by: Hussein Y. Afeefy, Joel F. Liebman, and Stephen E. Stein
Quantity | Value | Units | Method | Reference | Comment |
---|---|---|---|---|---|
ΔfH°liquid | 193. ± 4. | kJ/mol | Ccb | Walsh, Martin, et al., 1981 | |
Quantity | Value | Units | Method | Reference | Comment |
ΔcH°liquid | -5056. ± 4. | kJ/mol | Ccb | Walsh, Martin, et al., 1981 | Corresponding ΔfHºliquid = 193. kJ/mol (simple calculation by NIST; no Washburn corrections) |

Phase change data

Data compiled as indicated in comments:
AC - William E. Acree, Jr., James S. Chickos
ALS - Hussein Y. Afeefy, Joel F. Liebman, and Stephen E. Stein
DRB - Donald R. Burgess, Jr.
Quantity | Value | Units | Method | Reference | Comment |
---|---|---|---|---|---|
ΔvapH° | 41.8 ± 1.7 | kJ/mol | N/A | Osmont, Catoire, et al., 2008 | AC |
ΔvapH° | 42. ± 2. | kJ/mol | E | Walsh, Martin, et al., 1981 | ALS |
ΔvapH° | 42.0 | kJ/mol | N/A | Walsh, Martin, et al., 1981 | DRB |

Gas phase ion energetics data

Data compiled as indicated in comments:
LLK - Sharon G. Lias, Rhoda D. Levin, and Sherif A. Kafafi
Ionization energy determinations
IE (eV) | Method | Reference | Comment |
---|---|---|---|
9.18 | PE | Gleiter, Heilbronner, et al., 1973 | Vertical value; LLK |

References

Walsh, Martin, et al., 1981
Walsh, R.; Martin, H-D.; Kunze, M.; Oftring, A.; Beckhaus, H-D.,
Small rings. Part 32. The gas phase kinetics, mechanism, and energy hypersurface for the thermolyses of syn- and anti-tricyclo[4.2.0.02,5]-octane,
J. Chem. Soc. Perkin Trans. 2, 1981, 1076-1083. [all data]
Osmont, Catoire, et al., 2008
Osmont, Antoine; Catoire, Laurent; Gokalp, Iskender,
Physicochemical Properties and Thermochemistry of Propellanes,
Energy Fuels, 2008, 22, 4, 2241-2257, https://doi.org/10.1021/ef8000423
. [all data]
Gleiter, Heilbronner, et al., 1973
Gleiter, R.; Heilbronner, E.; Hekman, M.; Martin, H.-D.,
π-Orbital-Wechselwirkungen "through space" and "through bond" in tricyclo[4.2.0.02,5]octadienen,
Chem. Ber., 1973, 106, 28. [all data]