Bicyclo[2.1.1]hexane
- Formula: C6H10
- Molecular weight: 82.1436
- IUPAC Standard InChIKey: JSMRMEYFZHIPJV-UHFFFAOYSA-N
- CAS Registry Number: 285-86-9
- Chemical structure:
View 3d structure (requires JavaScript / HTML 5) - Permanent link for this species. Use this link for bookmarking this species for future reference.

Phase change data

Data compiled by: Robert L. Brown and Stephen E. Stein
Quantity | Value | Units | Method | Reference | Comment |
---|---|---|---|---|---|
Tboil | 344. | K | N/A | Buckingham and Donaghy, 1982 |

Reaction thermochemistry data

Data compiled by: Hussein Y. Afeefy, Joel F. Liebman, and Stephen E. Stein
Individual Reactions
Quantity | Value | Units | Method | Reference | Comment |
---|---|---|---|---|---|
ΔrH° | -171. ± 0.4 | kJ/mol | Chyd | Roth, Adamczak, et al., 1991 | liquid phase |

Gas phase ion energetics data

Data compiled as indicated in comments:
LBLHLM - Sharon G. Lias, John E. Bartmess, Joel F. Liebman, John L. Holmes, Rhoda D. Levin, and W. Gary Mallard
Ionization energy determinations
IE (eV) | Method | Reference | Comment |
---|---|---|---|
9.7 | PE | Della, Pigou, et al., 1984 | LBLHLM |
10.5 | PE | Della, Pigou, et al., 1984 | Vertical value; LBLHLM |

References

Buckingham and Donaghy, 1982
Buckingham, J.; Donaghy, S.M.,
Dictionary of Organic Compounds: Fifth Edition, Chapman and Hall, New York, 1982, 1. [all data]
Roth, Adamczak, et al., 1991
Roth, W.R.; Adamczak, O.; Breuckmann, R.; Lennartz, H.-W.; Boese, R.,
Die Berechnung von Resonanzenergien; das MM2ERW-Kraftfeld,
Chem. Ber., 1991, 124, 2499-2521. [all data]
Della, Pigou, et al., 1984
Della, E.W.; Pigou, P.E.; Livett, M.K.; Peel, J.B.,
The photoelectron spectrum and molecular geometry of bicyclo[2.1.1]hexane,
J. Electron Spectrosc. Relat. Phenom., 1984, 33, 163. [all data]