Anthra[1,2-e]acephenanthrylene
- Formula: C28H16
- Molecular weight: 352.4266
- IUPAC Standard InChIKey: MPPRFVATAIGMDS-UHFFFAOYSA-N
- CAS Registry Number: 28512-55-2
- Chemical structure:
View 3d structure (requires JavaScript / HTML 5) - Other names: 1,2:10,11-Dibenzoperylene

Gas phase ion energetics data

Data compiled by: Henry M. Rosenstock, Keith Draxl, Bruce W. Steiner, and John T. Herron
Ionization energy determinations
IE (eV) | Method | Reference |
---|---|---|
6.84 | CTS | Briegleb, 1964 |
6.51 | CTS | Matsen, 1956 |

References

Briegleb, 1964
Briegleb, G.,
Electron affinity of organic molecules,
Angew. Chem. Intern. Ed., 1964, 3, 617. [all data]
Matsen, 1956
Matsen, F.A.,
Electron affinities, methyl affinities, and ionization energies of condensed ring aromatic hydrocarbons,
J. Chem. Phys., 1956, 24, 602. [all data]