2,6-Dichlorostyrene
- Formula: C8H6Cl2
- Molecular weight: 173.039
- IUPAC Standard InChIKey: YJCVRMIJBXTMNR-UHFFFAOYSA-N
- CAS Registry Number: 28469-92-3
- Chemical structure:
View 3d structure (requires JavaScript / HTML 5) - Other names: Benzene, 1,3-dichloro-2-ethenyl-; 1,3-Dichloro-2-vinylbenzene

Phase change data

Data compiled as indicated in comments:
BS - Robert L. Brown and Stephen E. Stein
AC - William E. Acree, Jr., James S. Chickos
Quantity | Value | Units | Method | Reference | Comment |
---|---|---|---|---|---|
ΔvapH° | 53.8 ± 1.5 | kJ/mol | GS | Puri, Chickos, et al., 2001 | AC |
Reduced pressure boiling point
Tboil (K) | Pressure (bar) | Reference | Comment |
---|---|---|---|
362.2 | 0.01 | Aldrich Chemical Company Inc., 1990 | BS |
337.7 | 0.004 | Weast and Grasselli, 1989 | BS |
Enthalpy of vaporization
ΔvapH (kJ/mol) | Temperature (K) | Method | Reference | Comment |
---|---|---|---|---|
50.4 | 336. | A | Stephenson and Malanowski, 1987 | Based on data from 321. to 490. K. See also Stull, 1947 and Dykyj and Vanko, 1970.; AC |

Gas phase ion energetics data

Data compiled by: Sharon G. Lias, Rhoda D. Levin, and Sherif A. Kafafi
Ionization energy determinations
IE (eV) | Method | Reference |
---|---|---|
8.70 ± 0.02 | PE | Maier and Turner, 1973 |

References

Puri, Chickos, et al., 2001
Puri, Swati; Chickos, James S.; Welsh, William J.,
Determination of Vaporization Enthalpies of Polychlorinated Biphenyls by Correlation Gas Chromatography,
Anal. Chem., 2001, 73, 7, 1480-1484, https://doi.org/10.1021/ac001246p
. [all data]
Aldrich Chemical Company Inc., 1990
Aldrich Chemical Company Inc.,
Catalog Handbook of Fine Chemicals, Aldrich Chemical Company, Inc., Milwaukee WI, 1990, 1. [all data]
Weast and Grasselli, 1989
CRC Handbook of Data on Organic Compounds, 2nd Editon, Weast,R.C and Grasselli, J.G., ed(s)., CRC Press, Inc., Boca Raton, FL, 1989, 1. [all data]
Stephenson and Malanowski, 1987
Stephenson, Richard M.; Malanowski, Stanislaw,
Handbook of the Thermodynamics of Organic Compounds, 1987, https://doi.org/10.1007/978-94-009-3173-2
. [all data]
Stull, 1947
Stull, Daniel R.,
Vapor Pressure of Pure Substances. Organic and Inorganic Compounds,
Ind. Eng. Chem., 1947, 39, 4, 517-540, https://doi.org/10.1021/ie50448a022
. [all data]
Dykyj and Vanko, 1970
Dykyj, J.; Vanko, A.,
Petrochemica, 1970, 10, 1, 3. [all data]
Maier and Turner, 1973
Maier, J.P.; Turner, D.W.,
Steric inhibition of resonance studied by molecular photoelectron spectroscopy. Part 2. Phenylethylenes,
J. Chem. Soc. Faraday Trans. 2, 1973, 69, 196. [all data]