Decane, 1,2-dibromo-
- Formula: C10H20Br2
- Molecular weight: 300.074
- IUPAC Standard InChIKey: XBRBOTTWTQOCJH-UHFFFAOYSA-N
- CAS Registry Number: 28467-71-2
- Chemical structure:
View 3d structure (requires JavaScript / HTML 5) - Other names: 1,2-Dibromodecane

Phase change data

Data compiled as indicated in comments:
AC - William E. Acree, Jr., James S. Chickos
Enthalpy of vaporization
ΔvapH (kJ/mol) | Temperature (K) | Method | Reference | Comment |
---|---|---|---|---|
67.0 | 383. | A | Stephenson and Malanowski, 1987 | Based on data from 368. to 524. K. See also Stull, 1947 and Dykyj and Vanko, 1970.; AC |
Antoine Equation Parameters
log10(P) = A − (B / (T + C))
P = vapor pressure (bar)
T = temperature (K)
View plot Requires a JavaScript / HTML 5 canvas capable browser.
Temperature (K) | A | B | C | Reference | Comment |
---|---|---|---|---|---|
368.8 to 523.6 | 6.34589 | 3147.571 | -27.425 | Stull, 1947 | Coefficents calculated by NIST from author's data. |

References

Stephenson and Malanowski, 1987
Stephenson, Richard M.; Malanowski, Stanislaw,
Handbook of the Thermodynamics of Organic Compounds, 1987, https://doi.org/10.1007/978-94-009-3173-2
. [all data]
Stull, 1947
Stull, Daniel R.,
Vapor Pressure of Pure Substances. Organic and Inorganic Compounds,
Ind. Eng. Chem., 1947, 39, 4, 517-540, https://doi.org/10.1021/ie50448a022
. [all data]
Dykyj and Vanko, 1970
Dykyj, J.; Vanko, A.,
Petrochemica, 1970, 10, 1, 3. [all data]