3-Aminobenzophenone
- Formula: C13H11NO
- Molecular weight: 197.2325
- IUPAC Standard InChIKey: FUADXEJBHCKVBN-UHFFFAOYSA-N
- CAS Registry Number: 2835-78-1
- Chemical structure:
View 3d structure (requires JavaScript / HTML 5) - Other names: Methanone, (3-aminophenyl)phenyl-; Benzophenone, 3-amino-; m-Aminobenzophenone; 3-Benzoylaniline

Gas phase ion energetics data

Data compiled by: Sharon G. Lias, Rhoda D. Levin, and Sherif A. Kafafi
Ionization energy determinations
IE (eV) | Method | Reference |
---|---|---|
8.5 ± 0.1 | EI | Krenmayr, Heller, et al., 1974 |
8.5 ± 0.1 | EI | Heller, Varmuza, et al., 1974 |
Appearance energy determinations
Ion | AE (eV) | Other Products | Method | Reference | Comment |
---|---|---|---|---|---|
C6H5+ | 16.2 ± 0.3 | ? | EI | Krenmayr, Heller, et al., 1974 | |
C6H6N+ | 14.6 ± 0.2 | ? | EI | Krenmayr, Heller, et al., 1974 | |
C7H5O+ | 12.3 ± 0.2 | ? | EI | Krenmayr, Heller, et al., 1974 | |
C7H6NO+ | 12.0 ± 0.1 | ? | EI | Krenmayr, Heller, et al., 1974 | |
C7H6NO+ | 12.0 ± 0.1 | ? | EI | Heller, Varmuza, et al., 1974 | |
C13H8O+ | 12.3 ± 0.3 | ? | EI | Krenmayr, Heller, et al., 1974 |

References

Krenmayr, Heller, et al., 1974
Krenmayr, P.; Heller, R.; Varmuza, K.,
Massenspektrometrische untersuchungen an benzophenon und substituierten benzophenonen. I. Ermittlung thermodynamischer grossen,
Org. Mass Spectrom., 1974, 9, 998. [all data]
Heller, Varmuza, et al., 1974
Heller, R.; Varmuza, K.; Krenmayr, P.,
Massenspektrometrische untersuchung des substituenteneffektes bei einfach substituierten benzophenonen,
Monatsh. Chem., 1974, 105, 787. [all data]
Grammaticakis, 1953
Grammaticakis, P.,
Contribution a l'etude de l'absorption dans l'ultra-violet moyen et le visible des arylamines isomeres et leurs derives N substitues (3e memoire),
Bull. Soc. Chim. Fr., 1953, 20, 93-99. [all data]