2-Aminobenzophenone
- Formula: C13H11NO
- Molecular weight: 197.2325
- IUPAC Standard InChIKey: MAOBFOXLCJIFLV-UHFFFAOYSA-N
- CAS Registry Number: 2835-77-0
- Chemical structure:
View 3d structure (requires JavaScript / HTML 5) - Other names: o-Benzoylaniline; Methanone, (2-aminophenyl)phenyl-; o-Aminobenzophenone; Benzophenone, 2-amino-; 2-Benzoylaniline; 2-Benzoylbenzenamine; o-Aminophenyl phenyl ketone; (2-Amino-phenyl)-phenyl-methanone; 2-Aminophenyl phenyl ketone; 2-(Phenylcarbonyl)aniline; NSC 9422

Gas phase ion energetics data

Data compiled as indicated in comments:
LLK - Sharon G. Lias, Rhoda D. Levin, and Sherif A. Kafafi
Ionization energy determinations
IE (eV) | Method | Reference | Comment |
---|---|---|---|
8.3 ± 0.1 | EI | Krenmayr, Heller, et al., 1974 | LLK |
8.3 ± 0.1 | EI | Heller, Varmuza, et al., 1974 | LLK |
Appearance energy determinations
Ion | AE (eV) | Other Products | Method | Reference | Comment |
---|---|---|---|---|---|
C6H5+ | 15.6 ± 0.3 | ? | EI | Krenmayr, Heller, et al., 1974 | LLK |
C6H6N+ | 15.0 ± 0.3 | ? | EI | Krenmayr, Heller, et al., 1974 | LLK |
C7H5O+ | 12.6 ± 0.2 | ? | EI | Krenmayr, Heller, et al., 1974 | LLK |
C7H6NO+ | 11.9 ± 0.1 | ? | EI | Krenmayr, Heller, et al., 1974 | LLK |
C7H6NO+ | 11.9 ± 0.1 | ? | EI | Heller, Varmuza, et al., 1974 | LLK |
C13H8O+ | 11.2 ± 0.2 | ? | EI | Krenmayr, Heller, et al., 1974 | LLK |
C13H10NO+ | 10.6 ± 0.1 | H | EI | Krenmayr, Heller, et al., 1974 | LLK |

References

Krenmayr, Heller, et al., 1974
Krenmayr, P.; Heller, R.; Varmuza, K.,
Massenspektrometrische untersuchungen an benzophenon und substituierten benzophenonen. I. Ermittlung thermodynamischer grossen,
Org. Mass Spectrom., 1974, 9, 998. [all data]
Heller, Varmuza, et al., 1974
Heller, R.; Varmuza, K.; Krenmayr, P.,
Massenspektrometrische untersuchung des substituenteneffektes bei einfach substituierten benzophenonen,
Monatsh. Chem., 1974, 105, 787. [all data]
Grammaticakis, 1953
Grammaticakis, P.,
Contribution a l'etude de l'absorption dans l'ultra-violet moyen et le visible des arylamines isomeres et leurs derives N substitues (3e memoire),
Bull. Soc. Chim. Fr., 1953, 20, 93-99. [all data]